{"text_format":"1","workbook":"xlsx","n_sheets":7,"sheets":["Presentation","Summary","Pivots","Extract","Players","Tables","MatchD1"],"not_rendered":{"charts":0,"images":0,"macros":1,"external_links":0,"defined_names":6,"comments":0,"pivot_tables":12},"unopened":[],"bounds":{"document_bytes":16777216,"sheet_cells":100000,"rows_first":2000,"rows_last":500,"rows_between":2000,"halvings":0,"cell_chars":16384,"cell_head_chars":4096},"cells_cut":0,"cells_raw":0,"read":"whole","date_system":"1900"}

{"sheet":"Presentation","index":0,"n_rows":76,"n_cols":8,"rows_kept":76,"cut":false,"hidden":false,"merged":[[6,6,6,7],[69,2,69,5],[6,2,6,5]]}
[]
[null,"Pick a player in the Yellow Box"]
[]
[null,"Name"]
[null,"Richard Butland",null,null,{"$f":"INDEX(Pivots!$T$4:$T$78,MATCH(B5,Pivots!$W$4:$W$78,0))","v":"RB"}]
[]
{"$rows_left_out":71}
{"sheet":"Summary","index":1,"n_rows":26,"n_cols":21,"rows_kept":26,"cut":false,"hidden":false,"merged":[[1,3,1,6],[1,10,1,13],[1,17,1,20],[1,2,2,2],[1,9,2,9],[1,16,2,16]]}
[]
[null,"Dawes","Appearances","Relative Score per match",null,null,null,null,"Porter","Appearances","Relative Score per match",null,null,null,null,"Markham","Appearances","Relative Score per match"]
[null,"Player",null,"Overall","Dawes","Porter","Markham",null,"Player","Appearances","Overall","Dawes","Porter","Markham",null,"Player","Appearances","Overall","Dawes","Porter","Markham"]
[1,{"$f":"IF(ISNA(VLOOKUP($A4,Extract!$AC$4:$AJ$42,2,0)),\"\",VLOOKUP(VLOOKUP($A4,Extract!$AC$4:$AJ$42,2,0),Players!$A$2:$B$91,2))","v":"Patrick Shields"},{"$f":"IF(ISNA(VLOOKUP($A4,Extract!$AC$4:$AJ$42,2,0)),\"\",VLOOKUP($A4,Extract!$AC$4:$AJ$42,3,0))","v":"10D"},{"$f":"IF(ISNA(VLOOKUP($A4,Extract!$AC$4:$AJ$42,2,0)),\"\",VLOOKUP($A4,Extract!$AC$4:$AJ$42,4,0))","v":15.867250000000002},{"$f":"IF(ISNA(VLOOKUP($A4,Extract!$AC$4:$AJ$42,2,0)),\"\",VLOOKUP($A4,Extract!$AC$4:$AJ$42,5,0))","v":15.867250000000002},{"$f":"IF(ISNA(VLOOKUP($A4,Extract!$AC$4:$AJ$42,2,0)),\"\",VLOOKUP($A4,Extract!$AC$4:$AJ$42,6,0))","v":""},{"$f":"IF(ISNA(VLOOKUP($A4,Extract!$AC$4:$AJ$42,2,0)),\"\",VLOOKUP($A4,Extract!$AC$4:$AJ$42,7,0))","v":""},null,{"$f":"IF(ISNA(VLOOKUP($A4,Extract!$AL$4:$AS$40,2,0)),\"\",VLOOKUP(VLOOKUP($A4,Extract!$AL$4:$AS$40,2,0),Players!$A$2:$B$95,2))","v":"Patrick Phair"},{"$f":"IF(ISNA(VLOOKUP($A4,Extract!$AL$4:$AS$42,2,0)),\"\",VLOOKUP($A4,Extract!$AL$4:$AS$42,3,0))","v":"8P1M"},{"$f":"IF(ISNA(VLOOKUP($A4,Extract!$AL$4:$AS$42,2,0)),\"\",VLOOKUP($A4,Extract!$AL$4:$AS$42,4,0))","v":9.3197222222222216},{"$f":"IF(ISNA(VLOOKUP($A4,Extract!$AL$4:$AS$42,2,0)),\"\",VLOOKUP($A4,Extract!$AL$4:$AS$42,5,0))","v":""},{"$f":"IF(ISNA(VLOOKUP($A4,Extract!$AL$4:$AS$42,2,0)),\"\",VLOOKUP($A4,Extract!$AL$4:$AS$42,6,0))","v":10.1096875},{"$f":"IF(ISNA(VLOOKUP($A4,Extract!$AL$4:$AS$42,2,0)),\"\",VLOOKUP($A4,Extract!$AL$4:$AS$42,7,0))","v":3},null,{"$f":"IF(ISNA(VLOOKUP($A4,Extract!$AU$4:$BB$40,2,0)),\"\",VLOOKUP(VLOOKUP($A4,Extract!$AU$4:$BB$40,2,0),Players!$A$2:$B$95,2))","v":"Ben Ritacca"},{"$f":"IF(ISNA(VLOOKUP($A4,Extract!$AU$4:$BA$42,2,0)),\"\",VLOOKUP($A4,Extract!$AU$4:$BA$42,3,0))","v":"2P3M"},{"$f":"IF(ISNA(VLOOKUP($A4,Extract!$AU$4:$BA$42,2,0)),\"\",VLOOKUP($A4,Extract!$AU$4:$BA$42,4,0))","v":22.215},{"$f":"IF(ISNA(VLOOKUP($A4,Extract!$AU$4:$BA$42,2,0)),\"\",VLOOKUP($A4,Extract!$AU$4:$BA$42,5,0))","v":""},{"$f":"IF(ISNA(VLOOKUP($A4,Extract!$AU$4:$BA$42,2,0)),\"\",VLOOKUP($A4,Extract!$AU$4:$BA$42,6,0))","v":3.5374999999999996},{"$f":"IF(ISNA(VLOOKUP($A4,Extract!$AU$4:$BA$42,2,0)),\"\",VLOOKUP($A4,Extract!$AU$4:$BA$42,7,0))","v":34.666666666666664}]
[{"$f":"A4+1","v":2},{"$f":"IF(ISNA(VLOOKUP($A5,Extract!$AC$4:$AJ$42,2,0)),\"\",VLOOKUP(VLOOKUP($A5,Extract!$AC$4:$AJ$42,2,0),Players!$A$2:$B$91,2))","v":"Richard Chamberlain"},{"$f":"IF(ISNA(VLOOKUP($A5,Extract!$AC$4:$AJ$42,2,0)),\"\",VLOOKUP($A5,Extract!$AC$4:$AJ$42,3,0))","v":"10D"},{"$f":"IF(ISNA(VLOOKUP($A5,Extract!$AC$4:$AJ$42,2,0)),\"\",VLOOKUP($A5,Extract!$AC$4:$AJ$42,4,0))","v":10.817250000000001},{"$f":"IF(ISNA(VLOOKUP($A5,Extract!$AC$4:$AJ$42,2,0)),\"\",VLOOKUP($A5,Extract!$AC$4:$AJ$42,5,0))","v":10.817250000000001},{"$f":"IF(ISNA(VLOOKUP($A5,Extract!$AC$4:$AJ$42,2,0)),\"\",VLOOKUP($A5,Extract!$AC$4:$AJ$42,6,0))","v":""},{"$f":"IF(ISNA(VLOOKUP($A5,Extract!$AC$4:$AJ$42,2,0)),\"\",VLOOKUP($A5,Extract!$AC$4:$AJ$42,7,0))","v":""},null,{"$f":"IF(ISNA(VLOOKUP($A5,Extract!$AL$4:$AS$40,2,0)),\"\",VLOOKUP(VLOOKUP($A5,Extract!$AL$4:$AS$40,2,0),Players!$A$2:$B$95,2))","v":"Peter Swales"},{"$f":"IF(ISNA(VLOOKUP($A5,Extract!$AL$4:$AS$42,2,0)),\"\",VLOOKUP($A5,Extract!$AL$4:$AS$42,3,0))","v":"6P3M"},{"$f":"IF(ISNA(VLOOKUP($A5,Extract!$AL$4:$AS$42,2,0)),\"\",VLOOKUP($A5,Extract!$AL$4:$AS$42,4,0))","v":10.966111111111111},{"$f":"IF(ISNA(VLOOKUP($A5,Extract!$AL$4:$AS$42,2,0)),\"\",VLOOKUP($A5,Extract!$AL$4:$AS$42,5,0))","v":""},{"$f":"IF(ISNA(VLOOKUP($A5,Extract!$AL$4:$AS$42,2,0)),\"\",VLOOKUP($A5,Extract!$AL$4:$AS$42,6,0))","v":9.9491666666666667},{"$f":"IF(ISNA(VLOOKUP($A5,Extract!$AL$4:$AS$42,2,0)),\"\",VLOOKUP($A5,Extract!$AL$4:$AS$42,7,0))","v":13},null,{"$f":"IF(ISNA(VLOOKUP($A5,Extract!$AU$4:$BB$40,2,0)),\"\",VLOOKUP(VLOOKUP($A5,Extract!$AU$4:$BB$40,2,0),Players!$A$2:$B$95,2))","v":"Richard Harris"},{"$f":"IF(ISNA(VLOOKUP($A5,Extract!$AU$4:$BA$42,2,0)),\"\",VLOOKUP($A5,Extract!$AU$4:$BA$42,3,0))","v":"4P5M"},{"$f":"IF(ISNA(VLOOKUP($A5,Extract!$AU$4:$BA$42,2,0)),\"\",VLOOKUP($A5,Extract!$AU$4:$BA$42,4,0))","v":15.403055555555556},{"$f":"IF(ISNA(VLOOKUP($A5,Extract!$AU$4:$BA$42,2,0)),\"\",VLOOKUP($A5,Extract!$AU$4:$BA$42,5,0))","v":""},{"$f":"IF(ISNA(VLOOKUP($A5,Extract!$AU$4:$BA$42,2,0)),\"\",VLOOKUP($A5,Extract!$AU$4:$BA$42,6,0))","v":4.7062499999999998},{"$f":"IF(ISNA(VLOOKUP($A5,Extract!$AU$4:$BA$42,2,0)),\"\",VLOOKUP($A5,Extract!$AU$4:$BA$42,7,0))","v":23.960500000000003}]
[{"$f":"A5+1","v":3},{"$f":"IF(ISNA(VLOOKUP($A6,Extract!$AC$4:$AJ$42,2,0)),\"\",VLOOKUP(VLOOKUP($A6,Extract!$AC$4:$AJ$42,2,0),Players!$A$2:$B$91,2))","v":"John Atthey"},{"$f":"IF(ISNA(VLOOKUP($A6,Extract!$AC$4:$AJ$42,2,0)),\"\",VLOOKUP($A6,Extract!$AC$4:$AJ$42,3,0))","v":"4D"},{"$f":"IF(ISNA(VLOOKUP($A6,Extract!$AC$4:$AJ$42,2,0)),\"\",VLOOKUP($A6,Extract!$AC$4:$AJ$42,4,0))","v":9.2756250000000016},{"$f":"IF(ISNA(VLOOKUP($A6,Extract!$AC$4:$AJ$42,2,0)),\"\",VLOOKUP($A6,Extract!$AC$4:$AJ$42,5,0))","v":9.2756250000000016},{"$f":"IF(ISNA(VLOOKUP($A6,Extract!$AC$4:$AJ$42,2,0)),\"\",VLOOKUP($A6,Extract!$AC$4:$AJ$42,6,0))","v":""},{"$f":"IF(ISNA(VLOOKUP($A6,Extract!$AC$4:$AJ$42,2,0)),\"\",VLOOKUP($A6,Extract!$AC$4:$AJ$42,7,0))","v":""},null,{"$f":"IF(ISNA(VLOOKUP($A6,Extract!$AL$4:$AS$40,2,0)),\"\",VLOOKUP(VLOOKUP($A6,Extract!$AL$4:$AS$40,2,0),Players!$A$2:$B$95,2))","v":"Paul Lilley"},{"$f":"IF(ISNA(VLOOKUP($A6,Extract!$AL$4:$AS$42,2,0)),\"\",VLOOKUP($A6,Extract!$AL$4:$AS$42,3,0))","v":"6P3M"},{"$f":"IF(ISNA(VLOOKUP($A6,Extract!$AL$4:$AS$42,2,0)),\"\",VLOOKUP($A6,Extract!$AL$4:$AS$42,4,0))","v":10.966111111111111},{"$f":"IF(ISNA(VLOOKUP($A6,Extract!$AL$4:$AS$42,2,0)),\"\",VLOOKUP($A6,Extract!$AL$4:$AS$42,5,0))","v":""},{"$f":"IF(ISNA(VLOOKUP($A6,Extract!$AL$4:$AS$42,2,0)),\"\",VLOOKUP($A6,Extract!$AL$4:$AS$42,6,0))","v":9.9491666666666667},{"$f":"IF(ISNA(VLOOKUP($A6,Extract!$AL$4:$AS$42,2,0)),\"\",VLOOKUP($A6,Extract!$AL$4:$AS$42,7,0))","v":13},null,{"$f":"IF(ISNA(VLOOKUP($A6,Extract!$AU$4:$BB$40,2,0)),\"\",VLOOKUP(VLOOKUP($A6,Extract!$AU$4:$BB$40,2,0),Players!$A$2:$B$95,2))","v":"Tony Letts"},{"$f":"IF(ISNA(VLOOKUP($A6,Extract!$AU$4:$BA$42,2,0)),\"\",VLOOKUP($A6,Extract!$AU$4:$BA$42,3,0))","v":"4P5M"},{"$f":"IF(ISNA(VLOOKUP($A6,Extract!$AU$4:$BA$42,2,0)),\"\",VLOOKUP($A6,Extract!$AU$4:$BA$42,4,0))","v":8.8224999999999998},{"$f":"IF(ISNA(VLOOKUP($A6,Extract!$AU$4:$BA$42,2,0)),\"\",VLOOKUP($A6,Extract!$AU$4:$BA$42,5,0))","v":""},{"$f":"IF(ISNA(VLOOKUP($A6,Extract!$AU$4:$BA$42,2,0)),\"\",VLOOKUP($A6,Extract!$AU$4:$BA$42,6,0))","v":4.5},{"$f":"IF(ISNA(VLOOKUP($A6,Extract!$AU$4:$BA$42,2,0)),\"\",VLOOKUP($A6,Extract!$AU$4:$BA$42,7,0))","v":12.2805}]
{"$rows_left_out":21}
{"sheet":"Pivots","index":2,"n_rows":133,"n_cols":53,"rows_kept":133,"cut":false,"hidden":true,"merged":[[2,6,2,8],[0,3,0,5]]}
[null,"Match","(Multiple Items)","All From 18/19 Season (19/20)",null,null,"Use the filter to edit",null,null,null,"Match","(Multiple Items)"]
["PT2",null,null,null,null,null,"Put a description in the Y box",null,null,"PT3",null,null,null,null,null,null,null,null,"PT4",null,null,null,null,null,null,null,"PT5",null,null,null,null,null,"PT1",null,null,null,null,null,null,null,null,"PT6"]
[null,"Row Labels","Count of Match","Sum of Butler","Sum of Relative",null,"Current Season",null,null,null,"Row Labels","Sum of Relative","Count of Match","Sum of Butler",null,null,null,null,null,"Row Labels","Sum of Butler","Sum of MatchS","Name",null,null,null,null,"Row Labels","Average of Relative","Average of Butler",null,null,null,"Player1","RB",null,null,null,null,null,null,null,"Player1","RB",null,null,null,null,null,"Sum of Butler","Column Labels"]
[null,"AKA",3,-31,-73,null,null,null,null,null,"AKM",-21.5,1,-10,null,null,null,null,null,"AKA",-38,143,{"$f":"IF(T4=\"\",\"\",VLOOKUP(T4,Players!$A$2:$B$98,2))","v":"Ashok Kwatra"},null,null,null,null,"AKA",-10.535714285714286,-5.4285714285714288,null,null,null,null,null,null,null,null,null,null,null,null,null,null,null,null,null,null,null,"Row Labels",1,2,3]
[null,3,3,-31,-73,null,null,null,null,null,1,-21.5,1,-10,null,null,null,null,null,"AKM",14,96,{"$f":"IF(T5=\"\",\"\",VLOOKUP(T5,Players!$A$2:$B$98,2))","v":"Andrew Kambites"},null,null,null,null,"DS",15,18,null,null,null,null,null,"Values",null,null,null,null,null,null,null,"Values",null,null,null,null,null,1,-192,-74,4]
[null,"AKM",1,-10,-21.5,null,null,null,null,null,"APR",20,2,63,null,null,null,null,null,"APO",-33,-13,{"$f":"IF(T6=\"\",\"\",VLOOKUP(T6,Players!$A$2:$B$98,2))","v":"Andrea Powell"},null,null,null,null,"LH",-20.75,-14.8,null,null,null,"Row Labels","Player2","Average of Team","Sum of Butler","Sum of MatchS","Sum of Relative",null,null,null,"Row Labels","Count of Match","Sum of Butler","Sum of Relative",null,null,null,2,246,258,122]
{"$rows_left_out":128}
{"sheet":"Extract","index":3,"n_rows":103,"n_cols":54,"rows_kept":103,"cut":false,"hidden":true,"merged":[]}
[]
[null,null,null,null,null,null,null,null,null,null,null,null,null,null,null,null,null,null,null,null,null,null,null,null,"Apps","(Multiple Items)",null,null,null,"Team",1,null,null,null,null,null,null,null,"Team",2,null,null,null,null,null,null,null,"Team",3]
[null,null,"Overall",null,null,null,null,null,null,"Partners",null,null,null,null,null,null,null,null,"For Summary"]
[null,null,"PLAYER","Div","Apps","Butler","Relative",null,null,"Match",null,null,"Average of Team","Sum of Butler","Sum of MatchS","Sum of Relative",null,null,"Row Labels","Average of Guess T","Apps",null,null,null,"Row Labels","Team","Appear",null,"Rank","Row Labels","Apps","Score",1,2,3,"Sort",null,"Rank","Row Labels",null,null,1,2,3,"Sort",null,"Rank","Row Labels",null,null,1,2,3,"Sort"]
[null,null,{"$f":"Presentation!E5","v":"RB"},1,{"$f":"IFERROR(GETPIVOTDATA(\"Count of Match\",Pivots!$B$3,\"Player2\",Extract!$C$5,\"Team\",D5),\"\")","v":11},{"$f":"IFERROR(GETPIVOTDATA(\"Sum of Butler\",Pivots!$B$3,\"Player2\",$C$5,\"Team\",D5),\"\")","v":102.72},{"$f":"IFERROR(GETPIVOTDATA(\"Sum of Relative\",Pivots!$B$3,\"Player2\",$C$5,\"Team\",D5),\"\")","v":-67.897499999999994},null,null,{"$f":"Pivots!AH7","v":1},{"$f":"IFERROR(VLOOKUP(J5,Tables!$F$2:$H$40,2),\"\")","v":"Warks Sep 17"},{"$f":"Pivots!AI8","v":"GW"},{"$f":"IF(J5=0,\"\",GETPIVOTDATA(\"Average of Team\",Pivots!AH5,\"Match\",$J5,\"player2\",$L5))","v":1},{"$f":"IF(J5=0,\"\",GETPIVOTDATA(\"Sum of Butler\",Pivots!AI5,\"Match\",$J5,\"player2\",$L5))","v":-52},{"$f":"IF(J5=0,\"\",GETPIVOTDATA(\"Sum of MatchS\",Pivots!AJ5,\"Match\",$J5,\"player2\",$L5))","v":-96},{"$f":"IF(J5=0,\"\",GETPIVOTDATA(\"Sum of Relative\",Pivots!AK5,\"Match\",$J5,\"player2\",$L5))","v":-28},null,null,"AA",3,{"$f":"IFERROR(GETPIVOTDATA(\"Count of Match\",Pivots!B$3,\"Player2\",S5),\"\")","v":""},null,null,null,"AKA",3,3,null,{"$f":"IF(AD5=\"\",\"\",RANK(AJ5,$AJ$5:$AJ$42))","v":11},"AKM",{"$f":"IF(AG5=\"\",\"\",GETPIVOTDATA(\"Count of Match\",Pivots!$B$3,\"Player2\",$AD5,\"Team\",1)&\"D\")&IF(AH5=\"\",\"\",GETPIVOTDATA(\"Count of Match\",Pivots!$B$3,\"Player2\",$AD5,\"Team\",2)&\"P\")&IF(AI5=\"\",\"\",GETPIVOTDATA(\"Count of Match\",Pivots!$B$3,\"Player2\",$AD5,\"Team\",3)&\"M\")","v":"1D"},{"$f":"IF(AD5=\"\",\"\",GETPIVOTDATA(\"Sum of Relative\",Pivots!$B$3,\"Player2\",$AD5)/GETPIVOTDATA(\"Count of Match\",Pivots!$B$3,\"Player2\",$AD5))","v":-21.5},{"$f":"IFERROR(GETPIVOTDATA(\"Sum of Relative\",Pivots!$B$3,\"Player2\",$AD5,\"Team\",AG$4)/GETPIVOTDATA(\"Count of Match\",Pivots!$B$3,\"Player2\",$AD5,\"Team\",AG$4),\"\")","v":-21.5},{"$f":"IFERROR(GETPIVOTDATA(\"Sum of Relative\",Pivots!$B$3,\"Player2\",$AD5,\"Team\",AH$4)/GETPIVOTDATA(\"Count of Match\",Pivots!$B$3,\"Player2\",$AD5,\"Team\",AH$4),\"\")","v":""},{"$f":"IFERROR(GETPIVOTDATA(\"Sum of Relative\",Pivots!$B$3,\"Player2\",$AD5,\"Team\",AI$4)/GETPIVOTDATA(\"Count of Match\",Pivots!$B$3,\"Player2\",$AD5,\"Team\",AI$4),\"\")","v":""},{"$f":"IF(AG5=\"\",\"\",AG5+ROW(AD5)/100000)","v":-21.499949999999998},null,{"$f":"IF(AM5=\"\",\"\",RANK(AS5,$AS$5:$AS$42))","v":13},"JAR",{"$f":"IF(AP5=\"\",\"\",GETPIVOTDATA(\"Count of Match\",Pivots!$B$3,\"Player2\",$AM5,\"Team\",1)&\"D\")&IF(AQ5=\"\",\"\",GETPIVOTDATA(\"Count of Match\",Pivots!$B$3,\"Player2\",$AM5,\"Team\",2)&\"P\")&IF(AR5=\"\",\"\",GETPIVOTDATA(\"Count of Match\",Pivots!$B$3,\"Player2\",$AM5,\"Team\",3)&\"M\")","v":"3P2M"},{"$f":"IF(AM5=\"\",\"\",GETPIVOTDATA(\"Sum of Relative\",Pivots!$B$3,\"Player2\",$AM5)/GETPIVOTDATA(\"Count of Match\",Pivots!$B$3,\"Player2\",$AM5))","v":-10.1},{"$f":"IFERROR(GETPIVOTDATA(\"Sum of Relative\",Pivots!$B$3,\"Player2\",$AM5,\"Team\",AP$4)/GETPIVOTDATA(\"Count of Match\",Pivots!$B$3,\"Player2\",$AM5,\"Team\",AP$4),\"\")","v":""},{"$f":"IFERROR(GETPIVOTDATA(\"Sum of Relative\",Pivots!$B$3,\"Player2\",$AM5,\"Team\",AQ$4)/GETPIVOTDATA(\"Count of Match\",Pivots!$B$3,\"Player2\",$AM5,\"Team\",AQ$4),\"\")","v":-17.833333333333332},{"$f":"IFERROR(GETPIVOTDATA(\"Sum of Relative\",Pivots!$B$3,\"Player2\",$AM5,\"Team\",AR$4)/GETPIVOTDATA(\"Count of Match\",Pivots!$B$3,\"Player2\",$AM5,\"Team\",AR$4),\"\")","v":1.5},{"$f":"IF(AQ5=\"\",\"\",AQ5+ROW(AM5)/100000)","v":-17.83328333333333},null,{"$f":"IF(AV5=\"\",\"\",RANK(BB5,$BB$5:$BB$42))","v":15},"AKA",{"$f":"IF(AY5=\"\",\"\",GETPIVOTDATA(\"Count of Match\",Pivots!$B$3,\"Player2\",$AV5,\"Team\",1)&\"D\")&IF(AZ5=\"\",\"\",GETPIVOTDATA(\"Count of Match\",Pivots!$B$3,\"Player2\",$AV5,\"Team\",2)&\"P\")&IF(BA5=\"\",\"\",GETPIVOTDATA(\"Count of Match\",Pivots!$B$3,\"Player2\",$AV5,\"Team\",3)&\"M\")","v":"3M"},{"$f":"IF(AV5=\"\",\"\",GETPIVOTDATA(\"Sum of Relative\",Pivots!$B$3,\"Player2\",$AV5)/GETPIVOTDATA(\"Count of Match\",Pivots!$B$3,\"Player2\",$AV5))","v":-24.333333333333332},{"$f":"IFERROR(GETPIVOTDATA(\"Sum of Relative\",Pivots!$B$3,\"Player2\",$AV5,\"Team\",AY$4)/GETPIVOTDATA(\"Count of Match\",Pivots!$B$3,\"Player2\",$AV5,\"Team\",AY$4),\"\")","v":""},{"$f":"IFERROR(GETPIVOTDATA(\"Sum of Relative\",Pivots!$B$3,\"Player2\",$AV5,\"Team\",AZ$4)/GETPIVOTDATA(\"Count of Match\",Pivots!$B$3,\"Player2\",$AV5,\"Team\",AZ$4),\"\")","v":""},{"$f":"IFERROR(GETPIVOTDATA(\"Sum of Relative\",Pivots!$B$3,\"Player2\",$AV5,\"Team\",BA$4)/GETPIVOTDATA(\"Count of Match\",Pivots!$B$3,\"Player2\",$AV5,\"Team\",BA$4),\"\")","v":-24.333333333333332},{"$f":"IF(BA5=\"\",\"\",BA5+ROW(AV5)/100000)","v":-24.33328333333333}]
[null,null,null,2,{"$f":"IFERROR(GETPIVOTDATA(\"Count of Match\",Pivots!$B$3,\"Player2\",Extract!$C$5,\"Team\",D6),\"\")","v":""},{"$f":"IFERROR(GETPIVOTDATA(\"Sum of Butler\",Pivots!$B$3,\"Player2\",$C$5,\"Team\",D6),\"\")","v":""},{"$f":"IFERROR(GETPIVOTDATA(\"Sum of Relative\",Pivots!$B$3,\"Player2\",$C$5,\"Team\",D6),\"\")","v":""},null,null,{"$f":"Pivots!AH9","v":3},{"$f":"IFERROR(VLOOKUP(J6,Tables!$F$2:$H$40,2),\"\")","v":"Worcs Nov 17"},{"$f":"Pivots!AI10","v":"GW"},{"$f":"IF(J6=0,\"\",GETPIVOTDATA(\"Average of Team\",Pivots!AH6,\"Match\",$J6,\"player2\",$L6))","v":1},{"$f":"IF(J6=0,\"\",GETPIVOTDATA(\"Sum of Butler\",Pivots!AI6,\"Match\",$J6,\"player2\",$L6))","v":-13},{"$f":"IF(J6=0,\"\",GETPIVOTDATA(\"Sum of MatchS\",Pivots!AJ6,\"Match\",$J6,\"player2\",$L6))","v":42},{"$f":"IF(J6=0,\"\",GETPIVOTDATA(\"Sum of Relative\",Pivots!AK6,\"Match\",$J6,\"player2\",$L6))","v":-23.5},null,null,"AC",3,{"$f":"IFERROR(GETPIVOTDATA(\"Count of Match\",Pivots!B$3,\"Player2\",S6),\"\")","v":""},null,null,null,"AKM",1,1,null,13,"AW",{"$f":"IF(AG6=\"\",\"\",GETPIVOTDATA(\"Count of Match\",Pivots!$B$3,\"Player2\",$AD6,\"Team\",1)&\"D\")&IF(AH6=\"\",\"\",GETPIVOTDATA(\"Count of Match\",Pivots!$B$3,\"Player2\",$AD6,\"Team\",2)&\"P\")&IF(AI6=\"\",\"\",GETPIVOTDATA(\"Count of Match\",Pivots!$B$3,\"Player2\",$AD6,\"Team\",3)&\"M\")","v":"2D1P"},{"$f":"IF(AD6=\"\",\"\",GETPIVOTDATA(\"Sum of Relative\",Pivots!$B$3,\"Player2\",$AD6)/GETPIVOTDATA(\"Count of Match\",Pivots!$B$3,\"Player2\",$AD6))","v":-25.166666666666668},{"$f":"IFERROR(GETPIVOTDATA(\"Sum of Relative\",Pivots!$B$3,\"Player2\",$AD6,\"Team\",AG$4)/GETPIVOTDATA(\"Count of Match\",Pivots!$B$3,\"Player2\",$AD6,\"Team\",AG$4),\"\")","v":-23.875},{"$f":"IFERROR(GETPIVOTDATA(\"Sum of Relative\",Pivots!$B$3,\"Player2\",$AD6,\"Team\",AH$4)/GETPIVOTDATA(\"Count of Match\",Pivots!$B$3,\"Player2\",$AD6,\"Team\",AH$4),\"\")","v":-27.75},{"$f":"IFERROR(GETPIVOTDATA(\"Sum of Relative\",Pivots!$B$3,\"Player2\",$AD6,\"Team\",AI$4)/GETPIVOTDATA(\"Count of Match\",Pivots!$B$3,\"Player2\",$AD6,\"Team\",AI$4),\"\")","v":""},{"$f":"IF(AG6=\"\",\"\",AG6+ROW(AD6)/100000)","v":-23.874939999999999},null,8,"JC",{"$f":"IF(AP6=\"\",\"\",GETPIVOTDATA(\"Count of Match\",Pivots!$B$3,\"Player2\",$AM6,\"Team\",1)&\"D\")&IF(AQ6=\"\",\"\",GETPIVOTDATA(\"Count of Match\",Pivots!$B$3,\"Player2\",$AM6,\"Team\",2)&\"P\")&IF(AR6=\"\",\"\",GETPIVOTDATA(\"Count of Match\",Pivots!$B$3,\"Player2\",$AM6,\"Team\",3)&\"M\")","v":"1D8P"},{"$f":"IF(AM6=\"\",\"\",GETPIVOTDATA(\"Sum of Relative\",Pivots!$B$3,\"Player2\",$AM6)/GETPIVOTDATA(\"Count of Match\",Pivots!$B$3,\"Player2\",$AM6))","v":-2.9813888888888891},{"$f":"IFERROR(GETPIVOTDATA(\"Sum of Relative\",Pivots!$B$3,\"Player2\",$AM6,\"Team\",AP$4)/GETPIVOTDATA(\"Count of Match\",Pivots!$B$3,\"Player2\",$AM6,\"Team\",AP$4),\"\")","v":-6.75},{"$f":"IFERROR(GETPIVOTDATA(\"Sum of Relative\",Pivots!$B$3,\"Player2\",$AM6,\"Team\",AQ$4)/GETPIVOTDATA(\"Count of Match\",Pivots!$B$3,\"Player2\",$AM6,\"Team\",AQ$4),\"\")","v":-2.5103125000000004},{"$f":"IFERROR(GETPIVOTDATA(\"Sum of Relative\",Pivots!$B$3,\"Player2\",$AM6,\"Team\",AR$4)/GETPIVOTDATA(\"Count of Match\",Pivots!$B$3,\"Player2\",$AM6,\"Team\",AR$4),\"\")","v":""},{"$f":"IF(AQ6=\"\",\"\",AQ6+ROW(AM6)/100000)","v":-2.5102525000000004},null,9,"APR",{"$f":"IF(AY6=\"\",\"\",GETPIVOTDATA(\"Count of Match\",Pivots!$B$3,\"Player2\",$AV6,\"Team\",1)&\"D\")&IF(AZ6=\"\",\"\",GETPIVOTDATA(\"Count of Match\",Pivots!$B$3,\"Player2\",$AV6,\"Team\",2)&\"P\")&IF(BA6=\"\",\"\",GETPIVOTDATA(\"Count of Match\",Pivots!$B$3,\"Player2\",$AV6,\"Team\",3)&\"M\")","v":"4M"},{"$f":"IF(AV6=\"\",\"\",GETPIVOTDATA(\"Sum of Relative\",Pivots!$B$3,\"Player2\",$AV6)/GETPIVOTDATA(\"Count of Match\",Pivots!$B$3,\"Player2\",$AV6))","v":-3.25},{"$f":"IFERROR(GETPIVOTDATA(\"Sum of Relative\",Pivots!$B$3,\"Player2\",$AV6,\"Team\",AY$4)/GETPIVOTDATA(\"Count of Match\",Pivots!$B$3,\"Player2\",$AV6,\"Team\",AY$4),\"\")","v":""},{"$f":"IFERROR(GETPIVOTDATA(\"Sum of Relative\",Pivots!$B$3,\"Player2\",$AV6,\"Team\",AZ$4)/GETPIVOTDATA(\"Count of Match\",Pivots!$B$3,\"Player2\",$AV6,\"Team\",AZ$4),\"\")","v":""},{"$f":"IFERROR(GETPIVOTDATA(\"Sum of Relative\",Pivots!$B$3,\"Player2\",$AV6,\"Team\",BA$4)/GETPIVOTDATA(\"Count of Match\",Pivots!$B$3,\"Player2\",$AV6,\"Team\",BA$4),\"\")","v":-3.25},{"$f":"IF(BA6=\"\",\"\",BA6+ROW(AV6)/100000)","v":-3.2499400000000001}]
{"$rows_left_out":98}
{"sheet":"Players","index":4,"n_rows":80,"n_cols":3,"rows_kept":80,"cut":false,"hidden":true,"merged":[]}
["Player","Name","Guess T"]
["AA","Angelos Agathangelou",3]
["AC","Andrew Courtman",3]
["AKA","Ashok Kwatra",3]
["AKM","Andrew Kambites",1]
["APO","Andrea Powell",3]
{"$rows_left_out":75}
{"sheet":"Tables","index":5,"n_rows":22,"n_cols":11,"rows_kept":22,"cut":false,"hidden":true,"merged":[]}
[]
[null,"Div","Name",null,null,"Match","Date","Home",null,"Home / Away","Home / Away"]
[null,1,"Dawes",null,null,1,"Warks Sep 17","A",null,"H","A"]
[null,2,"Porter",null,null,{"$f":"F3+1","v":2},"Leics Oct 17","H"]
[null,3,"Markham",null,null,{"$f":"F4+1","v":3},"Worcs Nov 17","H"]
[null,null,null,null,null,4,"Derby Jan 18","H"]
{"$rows_left_out":17}
{"sheet":"MatchD1","index":6,"n_rows":992,"n_cols":9,"rows_kept":992,"cut":false,"hidden":true,"merged":[]}
["Player1","Player2","Team","Butler","Match","MatchS","Relative","P1","P2"]
["PPE","RCO",1,-48,1,{"$f":"IF(C2=1,VLOOKUP(E2,Pivots!$AX$3:$BA$45,2))/2+IF(C2=2,VLOOKUP(E2,Pivots!$AX$3:$BA$45,3))/2+IF(C2=3,VLOOKUP(E2,Pivots!$AX$3:$BA$45,4))/2","v":-96},{"$f":"IF(A2=\"\",\"\",D2-F2/4)","v":-24},{"$f":"VLOOKUP(A2,Players!$A$2:$B$92,2,FALSE)","v":"Pam Pearce"},{"$f":"VLOOKUP(B2,Players!A$2:$B$92,2,FALSE)","v":"Roy Collard"}]
["RB","GW",1,-52,1,{"$f":"IF(C3=1,VLOOKUP(E3,Pivots!$AX$3:$BA$45,2))/2+IF(C3=2,VLOOKUP(E3,Pivots!$AX$3:$BA$45,3))/2+IF(C3=3,VLOOKUP(E3,Pivots!$AX$3:$BA$45,4))/2","v":-96},-28,{"$f":"VLOOKUP(A3,Players!$A$2:$B$92,2,FALSE)","v":"Richard Butland"},{"$f":"VLOOKUP(B3,Players!A$2:$B$92,2,FALSE)","v":"Gary Watson"}]
["PD","RPL",1,31,1,{"$f":"IF(C4=1,VLOOKUP(E4,Pivots!$AX$3:$BA$45,2))/2+IF(C4=2,VLOOKUP(E4,Pivots!$AX$3:$BA$45,3))/2+IF(C4=3,VLOOKUP(E4,Pivots!$AX$3:$BA$45,4))/2","v":-96},55,{"$f":"VLOOKUP(A4,Players!$A$2:$B$92,2,FALSE)","v":"Paul Denning"},{"$f":"VLOOKUP(B4,Players!A$2:$B$92,2,FALSE)","v":"Richard Plackett"}]
["RHA","TG",1,-27,1,{"$f":"IF(C5=1,VLOOKUP(E5,Pivots!$AX$3:$BA$45,2))/2+IF(C5=2,VLOOKUP(E5,Pivots!$AX$3:$BA$45,3))/2+IF(C5=3,VLOOKUP(E5,Pivots!$AX$3:$BA$45,4))/2","v":-96},-3,{"$f":"VLOOKUP(A5,Players!$A$2:$B$92,2,FALSE)","v":"Richard Harris"},{"$f":"VLOOKUP(B5,Players!A$2:$B$92,2,FALSE)","v":"Tricia Gilham"}]
["APR","DA",2,-2,1,{"$f":"IF(C6=1,VLOOKUP(E6,Pivots!$AX$3:$BA$45,2))/2+IF(C6=2,VLOOKUP(E6,Pivots!$AX$3:$BA$45,3))/2+IF(C6=3,VLOOKUP(E6,Pivots!$AX$3:$BA$45,4))/2","v":-37},7.25,{"$f":"VLOOKUP(A6,Players!$A$2:$B$92,2,FALSE)","v":"Alison Pritchard"},{"$f":"VLOOKUP(B6,Players!A$2:$B$92,2,FALSE)","v":"David Atthey"}]
{"$rows_left_out":986}