{"text_format":"1","workbook":"xlsx","n_sheets":7,"sheets":["Presentation","Summary","Pivots","Extract","Players","Tables","MatchD1"],"not_rendered":{"charts":0,"images":0,"macros":1,"external_links":0,"defined_names":6,"comments":0,"pivot_tables":12},"unopened":[],"bounds":{"document_bytes":16777216,"sheet_cells":100000,"rows_first":2000,"rows_last":500,"rows_between":2000,"halvings":0,"cell_chars":16384,"cell_head_chars":4096},"cells_cut":0,"cells_raw":0,"read":"whole","date_system":"1900"}

{"sheet":"Presentation","index":0,"n_rows":76,"n_cols":8,"rows_kept":76,"cut":false,"hidden":false,"merged":[[6,6,6,7],[69,2,69,5],[6,2,6,5]]}
[]
[null,"Pick a player in the Yellow Box"]
[]
[null,"Name"]
[null,"Richard Butland",null,null,{"$f":"INDEX(Pivots!$T$4:$T$78,MATCH(B5,Pivots!$W$4:$W$78,0))","v":"RB"}]
[]
[null,null,{"$f":"Pivots!D1","v":"All From 18/19 Season (19/20)"},null,null,null,{"$f":"Pivots!G3","v":"Current Season"}]
[null,null,"Appeara- nces"," Total Butler","Relative Butler","Rel/ Match","Total Butler","Rel / Match"]
[null,{"$f":"VLOOKUP(Extract!D5,Tables!$B$3:$C$5,2)","v":"Dawes"},{"$f":"Extract!E5 & IF(C72=\"\",\"\",\" (\" ) & C72 & IF(C72=\"\",\"\",\")\")","v":"11 (5)"},{"$f":"Extract!F5","v":102.72},{"$f":"Extract!G5","v":-67.897499999999994},{"$f":"IF(Extract!E5=\"\",\"\",Extract!G5/Extract!E5)","v":-6.1724999999999994},{"$f":"D72","v":73.180000000000007},{"$f":"F72","v":-1.5939999999999999}]
[null,{"$f":"VLOOKUP(Extract!D6,Tables!$B$3:$C$5,2)","v":"Porter"},{"$f":"Extract!E6 & IF(C73=\"\",\"\",\" (\" ) & C73 & IF(C73=\"\",\"\",\")\")","v":""},{"$f":"Extract!F6","v":""},{"$f":"Extract!G6","v":""},{"$f":"IF(Extract!E6=\"\",\"\",Extract!G6/Extract!E6)","v":""},{"$f":"D73","v":""},{"$f":"F73","v":""}]
[null,{"$f":"VLOOKUP(Extract!D7,Tables!$B$3:$C$5,2)","v":"Markham"},{"$f":"Extract!E7 & IF(C74=\"\",\"\",\" (\" ) & C74 & IF(C74=\"\",\"\",\")\")","v":""},{"$f":"Extract!F7","v":""},{"$f":"Extract!G7","v":""},{"$f":"IF(Extract!E7=\"\",\"\",Extract!G7/Extract!E7)","v":""},{"$f":"D74","v":""},{"$f":"F74","v":""}]
[]
[null,"Total",{"$f":"Extract!E9 & IF(C76=\"\",\"\",\" (\") & C76  & IF(C76=\"\",\"\",\")\")","v":"11 (5)"},{"$f":"SUM(D9:D12)","v":102.72},{"$f":"SUM(E9:E12)","v":-67.897499999999994},{"$f":"E13/Extract!E9","v":-6.1724999999999994},{"$f":"D76","v":73.180000000000007},{"$f":"F76","v":-1.5939999999999999}]
[]
[null,"Wins","Losses",null,"Draws"]
[null,{"$f":"COUNTIF($G$16:$G$50,\">0\")","v":13},{"$f":"COUNTIF($G$16:$G$50,\"<0\")","v":3},null,{"$f":"COUNTIF($G$16:$G$47,\"=0\")","v":0}]
[]
[null,"Match","Home / Away","Partner","League","Butler","Match Score","Relative"]
[null,{"$f":"IFERROR(VLOOKUP(Extract!J5,Tables!$F$2:$H$40,2),\"\")","v":"Warks Sep 17"},{"$f":"IFERROR(VLOOKUP(Extract!J5,Tables!$F$2:$H$679,3),\"\")","v":"A"},{"$f":"IF(Extract!L5=0,\"\",Extract!L5)","v":"GW"},{"$f":"IF(ISNA(VLOOKUP(Extract!M5,Tables!$B$3:$C$5,2)),\"\",VLOOKUP(Extract!M5,Tables!$B$3:$C$5,2))","v":"Dawes"},{"$f":"Extract!N5","v":-52},{"$f":"Extract!O5","v":-96},{"$f":"IF(B19=\"\",\"\",F19-G19/4)","v":-28}]
[null,{"$f":"IFERROR(VLOOKUP(Extract!J6,Tables!$F$2:$H$40,2),\"\")","v":"Worcs Nov 17"},{"$f":"IFERROR(VLOOKUP(Extract!J6,Tables!$F$2:$H$679,3),\"\")","v":"H"},{"$f":"IF(Extract!L6=0,\"\",Extract!L6)","v":"GW"},{"$f":"IF(ISNA(VLOOKUP(Extract!M6,Tables!$B$3:$C$5,2)),\"\",VLOOKUP(Extract!M6,Tables!$B$3:$C$5,2))","v":"Dawes"},{"$f":"Extract!N6","v":-13},{"$f":"Extract!O6","v":42},{"$f":"IF(B20=\"\",\"\",F20-G20/4)","v":-23.5}]
[null,{"$f":"IFERROR(VLOOKUP(Extract!J7,Tables!$F$2:$H$40,2),\"\")","v":"Notts Feb 18"},{"$f":"IFERROR(VLOOKUP(Extract!J7,Tables!$F$2:$H$679,3),\"\")","v":"A"},{"$f":"IF(Extract!L7=0,\"\",Extract!L7)","v":"GW"},{"$f":"IF(ISNA(VLOOKUP(Extract!M7,Tables!$B$3:$C$5,2)),\"\",VLOOKUP(Extract!M7,Tables!$B$3:$C$5,2))","v":"Dawes"},{"$f":"Extract!N7","v":37},{"$f":"Extract!O7","v":61},21.75]
[null,{"$f":"IFERROR(VLOOKUP(Extract!J8,Tables!$F$2:$H$40,2),\"\")","v":"Staffs Mar 18"},{"$f":"IFERROR(VLOOKUP(Extract!J8,Tables!$F$2:$H$679,3),\"\")","v":"H"},{"$f":"IF(Extract!L8=0,\"\",Extract!L8)","v":"GW"},{"$f":"IF(ISNA(VLOOKUP(Extract!M8,Tables!$B$3:$C$5,2)),\"\",VLOOKUP(Extract!M8,Tables!$B$3:$C$5,2))","v":"Dawes"},{"$f":"Extract!N8","v":16},{"$f":"Extract!O8","v":76},-3]
[null,{"$f":"IFERROR(VLOOKUP(Extract!J9,Tables!$F$2:$H$40,2),\"\")","v":"Oxf Apr 18"},{"$f":"IFERROR(VLOOKUP(Extract!J9,Tables!$F$2:$H$679,3),\"\")","v":"H"},{"$f":"IF(Extract!L9=0,\"\",Extract!L9)","v":"KST"},{"$f":"IF(ISNA(VLOOKUP(Extract!M9,Tables!$B$3:$C$5,2)),\"\",VLOOKUP(Extract!M9,Tables!$B$3:$C$5,2))","v":"Dawes"},{"$f":"Extract!N9","v":-19},{"$f":"Extract!O9","v":71},-36.75]
[null,{"$f":"IFERROR(VLOOKUP(Extract!J10,Tables!$F$2:$H$40,2),\"\")","v":"Lei Sep 18"},{"$f":"IFERROR(VLOOKUP(Extract!J10,Tables!$F$2:$H$679,3),\"\")","v":"A"},{"$f":"IF(Extract!L10=0,\"\",Extract!L10)","v":"GW"},{"$f":"IF(ISNA(VLOOKUP(Extract!M10,Tables!$B$3:$C$5,2)),\"\",VLOOKUP(Extract!M10,Tables!$B$3:$C$5,2))","v":"Dawes"},{"$f":"Extract!N10","v":-11},{"$f":"Extract!O10","v":-1},-10.75]
[null,{"$f":"IFERROR(VLOOKUP(Extract!J11,Tables!$F$2:$H$40,2),\"\")","v":"Wor Oct 18"},{"$f":"IFERROR(VLOOKUP(Extract!J11,Tables!$F$2:$H$679,3),\"\")","v":"A"},{"$f":"IF(Extract!L11=0,\"\",Extract!L11)","v":"GW"},{"$f":"IF(ISNA(VLOOKUP(Extract!M11,Tables!$B$3:$C$5,2)),\"\",VLOOKUP(Extract!M11,Tables!$B$3:$C$5,2))","v":"Dawes"},{"$f":"Extract!N11","v":9.5399999999999991},{"$f":"Extract!O11","v":99.86999999999999},-15.427499999999998]
[null,{"$f":"IFERROR(VLOOKUP(Extract!J12,Tables!$F$2:$H$40,2),\"\")","v":"Oxf Nov 18"},{"$f":"IFERROR(VLOOKUP(Extract!J12,Tables!$F$2:$H$679,3),\"\")","v":"H"},{"$f":"IF(Extract!L12=0,\"\",Extract!L12)","v":"GW"},{"$f":"IF(ISNA(VLOOKUP(Extract!M12,Tables!$B$3:$C$5,2)),\"\",VLOOKUP(Extract!M12,Tables!$B$3:$C$5,2))","v":"Dawes"},{"$f":"Extract!N12","v":26},{"$f":"Extract!O12","v":69},8.75]
[null,{"$f":"IFERROR(VLOOKUP(Extract!J13,Tables!$F$2:$H$40,2),\"\")","v":" Notts Jan19"},{"$f":"IFERROR(VLOOKUP(Extract!J13,Tables!$F$2:$H$679,3),\"\")","v":"H"},{"$f":"IF(Extract!L13=0,\"\",Extract!L13)","v":"GW"},{"$f":"IF(ISNA(VLOOKUP(Extract!M13,Tables!$B$3:$C$5,2)),\"\",VLOOKUP(Extract!M13,Tables!$B$3:$C$5,2))","v":"Dawes"},{"$f":"Extract!N13","v":20},{"$f":"Extract!O13","v":121},-10.25]
[null,{"$f":"IFERROR(VLOOKUP(Extract!J14,Tables!$F$2:$H$40,2),\"\")","v":"Staffs Feb 19"},{"$f":"IFERROR(VLOOKUP(Extract!J14,Tables!$F$2:$H$679,3),\"\")","v":"A"},{"$f":"IF(Extract!L14=0,\"\",Extract!L14)","v":"GW"},{"$f":"IF(ISNA(VLOOKUP(Extract!M14,Tables!$B$3:$C$5,2)),\"\",VLOOKUP(Extract!M14,Tables!$B$3:$C$5,2))","v":"Dawes"},{"$f":"Extract!N14","v":2},{"$f":"Extract!O14","v":57},-12.25]
[null,{"$f":"IFERROR(VLOOKUP(Extract!J15,Tables!$F$2:$H$40,2),\"\")","v":"Warks Apr 19"},{"$f":"IFERROR(VLOOKUP(Extract!J15,Tables!$F$2:$H$679,3),\"\")","v":"H"},{"$f":"IF(Extract!L15=0,\"\",Extract!L15)","v":"GW"},{"$f":"IF(ISNA(VLOOKUP(Extract!M15,Tables!$B$3:$C$5,2)),\"\",VLOOKUP(Extract!M15,Tables!$B$3:$C$5,2))","v":"Dawes"},{"$f":"Extract!N15","v":-17},{"$f":"Extract!O15","v":12},-20]
[null,{"$f":"IFERROR(VLOOKUP(Extract!J16,Tables!$F$2:$H$40,2),\"\")","v":"Worcs Sep 19"},{"$f":"IFERROR(VLOOKUP(Extract!J16,Tables!$F$2:$H$679,3),\"\")","v":"H"},{"$f":"IF(Extract!L16=0,\"\",Extract!L16)","v":"GW"},{"$f":"IF(ISNA(VLOOKUP(Extract!M16,Tables!$B$3:$C$5,2)),\"\",VLOOKUP(Extract!M16,Tables!$B$3:$C$5,2))","v":"Dawes"},{"$f":"Extract!N16","v":31},{"$f":"Extract!O16","v":191},-16.75]
[null,{"$f":"IFERROR(VLOOKUP(Extract!J17,Tables!$F$2:$H$40,2),\"\")","v":"Oxford Oct 19"},{"$f":"IFERROR(VLOOKUP(Extract!J17,Tables!$F$2:$H$679,3),\"\")","v":"A"},{"$f":"IF(Extract!L17=0,\"\",Extract!L17)","v":"KST"},{"$f":"IF(ISNA(VLOOKUP(Extract!M17,Tables!$B$3:$C$5,2)),\"\",VLOOKUP(Extract!M17,Tables!$B$3:$C$5,2))","v":"Dawes"},{"$f":"Extract!N17","v":22},{"$f":"Extract!O17","v":1},21.75]
[null,{"$f":"IFERROR(VLOOKUP(Extract!J18,Tables!$F$2:$H$40,2),\"\")","v":"Derby Nov 19"},{"$f":"IFERROR(VLOOKUP(Extract!J18,Tables!$F$2:$H$679,3),\"\")","v":"H"},{"$f":"IF(Extract!L18=0,\"\",Extract!L18)","v":"AKM"},{"$f":"IF(ISNA(VLOOKUP(Extract!M18,Tables!$B$3:$C$5,2)),\"\",VLOOKUP(Extract!M18,Tables!$B$3:$C$5,2))","v":"Dawes"},{"$f":"Extract!N18","v":-10},{"$f":"Extract!O18","v":46},-21.5]
[null,{"$f":"IFERROR(VLOOKUP(Extract!J19,Tables!$F$2:$H$40,2),\"\")","v":"Notts Dec 19"},{"$f":"IFERROR(VLOOKUP(Extract!J19,Tables!$F$2:$H$679,3),\"\")","v":"A"},{"$f":"IF(Extract!L19=0,\"\",Extract!L19)","v":"GW"},{"$f":"IF(ISNA(VLOOKUP(Extract!M19,Tables!$B$3:$C$5,2)),\"\",VLOOKUP(Extract!M19,Tables!$B$3:$C$5,2))","v":"Dawes"},{"$f":"Extract!N19","v":26},{"$f":"Extract!O19","v":-3},26.75]
[null,{"$f":"IFERROR(VLOOKUP(Extract!J20,Tables!$F$2:$H$40,2),\"\")","v":"Warks Feb 20"},{"$f":"IFERROR(VLOOKUP(Extract!J20,Tables!$F$2:$H$679,3),\"\")","v":"A"},{"$f":"IF(Extract!L20=0,\"\",Extract!L20)","v":"GW"},{"$f":"IF(ISNA(VLOOKUP(Extract!M20,Tables!$B$3:$C$5,2)),\"\",VLOOKUP(Extract!M20,Tables!$B$3:$C$5,2))","v":"Dawes"},{"$f":"Extract!N20","v":4.18},{"$f":"Extract!O20","v":89.6},-18.22]
[null,{"$f":"IFERROR(VLOOKUP(Extract!J21,Tables!$F$2:$H$40,2),\"\")","v":""},{"$f":"IFERROR(VLOOKUP(Extract!J21,Tables!$F$2:$H$679,3),\"\")","v":""},{"$f":"IF(Extract!L21=0,\"\",Extract!L21)","v":""},{"$f":"IF(ISNA(VLOOKUP(Extract!M21,Tables!$B$3:$C$5,2)),\"\",VLOOKUP(Extract!M21,Tables!$B$3:$C$5,2))","v":""},{"$f":"Extract!N21","v":""},{"$f":"Extract!O21","v":""},""]
[null,{"$f":"IFERROR(VLOOKUP(Extract!J22,Tables!$F$2:$H$40,2),\"\")","v":""},{"$f":"IFERROR(VLOOKUP(Extract!J22,Tables!$F$2:$H$679,3),\"\")","v":""},{"$f":"IF(Extract!L22=0,\"\",Extract!L22)","v":""},{"$f":"IF(ISNA(VLOOKUP(Extract!M22,Tables!$B$3:$C$5,2)),\"\",VLOOKUP(Extract!M22,Tables!$B$3:$C$5,2))","v":""},{"$f":"Extract!N22","v":""},{"$f":"Extract!O22","v":""},""]
[null,{"$f":"IFERROR(VLOOKUP(Extract!J23,Tables!$F$2:$H$40,2),\"\")","v":""},{"$f":"IFERROR(VLOOKUP(Extract!J23,Tables!$F$2:$H$679,3),\"\")","v":""},{"$f":"IF(Extract!L23=0,\"\",Extract!L23)","v":""},{"$f":"IF(ISNA(VLOOKUP(Extract!M23,Tables!$B$3:$C$5,2)),\"\",VLOOKUP(Extract!M23,Tables!$B$3:$C$5,2))","v":""},{"$f":"Extract!N23","v":""},{"$f":"Extract!O23","v":""},""]
[null,{"$f":"IFERROR(VLOOKUP(Extract!J24,Tables!$F$2:$H$40,2),\"\")","v":""},{"$f":"IFERROR(VLOOKUP(Extract!J24,Tables!$F$2:$H$679,3),\"\")","v":""},{"$f":"IF(Extract!L24=0,\"\",Extract!L24)","v":""},{"$f":"IF(ISNA(VLOOKUP(Extract!M24,Tables!$B$3:$C$5,2)),\"\",VLOOKUP(Extract!M24,Tables!$B$3:$C$5,2))","v":""},{"$f":"Extract!N24","v":""},{"$f":"Extract!O24","v":""},""]
[null,{"$f":"IFERROR(VLOOKUP(Extract!J25,Tables!$F$2:$H$40,2),\"\")","v":""},{"$f":"IFERROR(VLOOKUP(Extract!J25,Tables!$F$2:$H$679,3),\"\")","v":""},{"$f":"IF(Extract!L25=0,\"\",Extract!L25)","v":""},{"$f":"IF(ISNA(VLOOKUP(Extract!M25,Tables!$B$3:$C$5,2)),\"\",VLOOKUP(Extract!M25,Tables!$B$3:$C$5,2))","v":""},{"$f":"Extract!N25","v":""},{"$f":"Extract!O25","v":""},""]
[null,{"$f":"IFERROR(VLOOKUP(Extract!J26,Tables!$F$2:$H$40,2),\"\")","v":""},{"$f":"IFERROR(VLOOKUP(Extract!J26,Tables!$F$2:$H$679,3),\"\")","v":""},{"$f":"IF(Extract!L26=0,\"\",Extract!L26)","v":""},{"$f":"IF(ISNA(VLOOKUP(Extract!M26,Tables!$B$3:$C$5,2)),\"\",VLOOKUP(Extract!M26,Tables!$B$3:$C$5,2))","v":""},{"$f":"Extract!N26","v":""},{"$f":"Extract!O26","v":""},""]
[null,{"$f":"IFERROR(VLOOKUP(Extract!J27,Tables!$F$2:$H$40,2),\"\")","v":""},{"$f":"IFERROR(VLOOKUP(Extract!J27,Tables!$F$2:$H$679,3),\"\")","v":""},{"$f":"IF(Extract!L27=0,\"\",Extract!L27)","v":""},{"$f":"IF(ISNA(VLOOKUP(Extract!M27,Tables!$B$3:$C$5,2)),\"\",VLOOKUP(Extract!M27,Tables!$B$3:$C$5,2))","v":""},{"$f":"Extract!N27","v":""},{"$f":"Extract!O27","v":""},""]
[null,{"$f":"IFERROR(VLOOKUP(Extract!J28,Tables!$F$2:$H$40,2),\"\")","v":""},{"$f":"IFERROR(VLOOKUP(Extract!J28,Tables!$F$2:$H$679,3),\"\")","v":""},{"$f":"IF(Extract!L28=0,\"\",Extract!L28)","v":""},{"$f":"IF(ISNA(VLOOKUP(Extract!M28,Tables!$B$3:$C$5,2)),\"\",VLOOKUP(Extract!M28,Tables!$B$3:$C$5,2))","v":""},{"$f":"Extract!N28","v":""},{"$f":"Extract!O28","v":""},""]
[null,{"$f":"IFERROR(VLOOKUP(Extract!J29,Tables!$F$2:$H$40,2),\"\")","v":""},{"$f":"IFERROR(VLOOKUP(Extract!J29,Tables!$F$2:$H$679,3),\"\")","v":""},{"$f":"IF(Extract!L29=0,\"\",Extract!L29)","v":""},{"$f":"IF(ISNA(VLOOKUP(Extract!M29,Tables!$B$3:$C$5,2)),\"\",VLOOKUP(Extract!M29,Tables!$B$3:$C$5,2))","v":""},{"$f":"Extract!N29","v":""},{"$f":"Extract!O29","v":""},""]
[null,{"$f":"IFERROR(VLOOKUP(Extract!J30,Tables!$F$2:$H$40,2),\"\")","v":""},{"$f":"IFERROR(VLOOKUP(Extract!J30,Tables!$F$2:$H$679,3),\"\")","v":""},{"$f":"IF(Extract!L30=0,\"\",Extract!L30)","v":""},{"$f":"IF(ISNA(VLOOKUP(Extract!M30,Tables!$B$3:$C$5,2)),\"\",VLOOKUP(Extract!M30,Tables!$B$3:$C$5,2))","v":""},{"$f":"Extract!N30","v":""},{"$f":"Extract!O30","v":""},""]
[null,{"$f":"IFERROR(VLOOKUP(Extract!J31,Tables!$F$2:$H$40,2),\"\")","v":""},{"$f":"IFERROR(VLOOKUP(Extract!J31,Tables!$F$2:$H$679,3),\"\")","v":""},{"$f":"IF(Extract!L31=0,\"\",Extract!L31)","v":""},{"$f":"IF(ISNA(VLOOKUP(Extract!M31,Tables!$B$3:$C$5,2)),\"\",VLOOKUP(Extract!M31,Tables!$B$3:$C$5,2))","v":""},{"$f":"Extract!N31","v":""},{"$f":"Extract!O31","v":""},""]
[null,{"$f":"IFERROR(VLOOKUP(Extract!J32,Tables!$F$2:$H$40,2),\"\")","v":""},{"$f":"IFERROR(VLOOKUP(Extract!J32,Tables!$F$2:$H$679,3),\"\")","v":""},{"$f":"IF(Extract!L32=0,\"\",Extract!L32)","v":""},{"$f":"IF(ISNA(VLOOKUP(Extract!M32,Tables!$B$3:$C$5,2)),\"\",VLOOKUP(Extract!M32,Tables!$B$3:$C$5,2))","v":""},{"$f":"Extract!N32","v":""},{"$f":"Extract!O32","v":""},""]
[null,{"$f":"IFERROR(VLOOKUP(Extract!J33,Tables!$F$2:$H$40,2),\"\")","v":""},{"$f":"IFERROR(VLOOKUP(Extract!J33,Tables!$F$2:$H$679,3),\"\")","v":""},{"$f":"IF(Extract!L33=0,\"\",Extract!L33)","v":""},{"$f":"IF(ISNA(VLOOKUP(Extract!M33,Tables!$B$3:$C$5,2)),\"\",VLOOKUP(Extract!M33,Tables!$B$3:$C$5,2))","v":""},{"$f":"Extract!N33","v":""},{"$f":"Extract!O33","v":""},""]
[null,{"$f":"IFERROR(VLOOKUP(Extract!J34,Tables!$F$2:$H$40,2),\"\")","v":""},{"$f":"IFERROR(VLOOKUP(Extract!J34,Tables!$F$2:$H$679,3),\"\")","v":""},{"$f":"IF(Extract!L34=0,\"\",Extract!L34)","v":""},{"$f":"IF(ISNA(VLOOKUP(Extract!M34,Tables!$B$3:$C$5,2)),\"\",VLOOKUP(Extract!M34,Tables!$B$3:$C$5,2))","v":""},{"$f":"Extract!N34","v":""},{"$f":"Extract!O34","v":""},""]
[null,{"$f":"IFERROR(VLOOKUP(Extract!J35,Tables!$F$2:$H$40,2),\"\")","v":""},{"$f":"IFERROR(VLOOKUP(Extract!J35,Tables!$F$2:$H$679,3),\"\")","v":""},{"$f":"IF(Extract!L35=0,\"\",Extract!L35)","v":""},{"$f":"IF(ISNA(VLOOKUP(Extract!M35,Tables!$B$3:$C$5,2)),\"\",VLOOKUP(Extract!M35,Tables!$B$3:$C$5,2))","v":""},{"$f":"Extract!N35","v":""},{"$f":"Extract!O35","v":""},""]
[null,{"$f":"IFERROR(VLOOKUP(Extract!J36,Tables!$F$2:$H$40,2),\"\")","v":""},{"$f":"IFERROR(VLOOKUP(Extract!J36,Tables!$F$2:$H$679,3),\"\")","v":""},{"$f":"IF(Extract!L36=0,\"\",Extract!L36)","v":""},{"$f":"IF(ISNA(VLOOKUP(Extract!M36,Tables!$B$3:$C$5,2)),\"\",VLOOKUP(Extract!M36,Tables!$B$3:$C$5,2))","v":""},{"$f":"Extract!N36","v":""},{"$f":"Extract!O36","v":""},""]
[null,{"$f":"DCOUNT(B18:F50,5,Tables!$J$2:$J$3)","v":8},{"$f":"DCOUNT(C18:G50,5,Tables!$K$2:$K$3)","v":8},null,null,{"$f":"SUM(F19:F50)","v":71.72},{"$f":"SUM(G19:G50)","v":836.47},{"$f":"IFERROR(F51-G51/4,\"\")","v":-137.39750000000001}]
[null,null,null,null,null,null,null,{"$f":"IF(H51=SUM(H19:H50),\"\",\"error\")","v":""}]
[]
[null,null,null,"Partner","Matches","Butlers","Relative","Rel/Match"]
[null,null,null,{"$f":"IF(ISBLANK(Pivots!AQ7),\"\",Pivots!AQ7)","v":"AKM"},{"$f":"IF(Pivots!AR7=0,\"\",Pivots!AR7)","v":1},{"$f":"IF(Pivots!AS7=0,\"\",Pivots!AS7)","v":-10},{"$f":"IF(Pivots!AT7=0,\"\",Pivots!AT7)","v":-21.5},{"$f":"IFERROR(G55/E55,\"\")","v":-21.5}]
[null,null,null,{"$f":"IF(ISBLANK(Pivots!AQ8),\"\",Pivots!AQ8)","v":"GW"},{"$f":"IF(Pivots!AR8=0,\"\",Pivots!AR8)","v":13},{"$f":"IF(Pivots!AS8=0,\"\",Pivots!AS8)","v":78.72},{"$f":"IF(Pivots!AT8=0,\"\",Pivots!AT8)","v":-100.89749999999999},{"$f":"IFERROR(G56/E56,\"\")","v":-7.7613461538461532}]
[null,null,null,{"$f":"IF(ISBLANK(Pivots!AQ9),\"\",Pivots!AQ9)","v":"KST"},{"$f":"IF(Pivots!AR9=0,\"\",Pivots!AR9)","v":2},{"$f":"IF(Pivots!AS9=0,\"\",Pivots!AS9)","v":3},{"$f":"IF(Pivots!AT9=0,\"\",Pivots!AT9)","v":-15},-7.5]
[null,null,null,{"$f":"IF(ISBLANK(Pivots!AQ10),\"\",Pivots!AQ10)","v":""},{"$f":"IF(Pivots!AR10=0,\"\",Pivots!AR10)","v":""},{"$f":"IF(Pivots!AS10=0,\"\",Pivots!AS10)","v":""},{"$f":"IF(Pivots!AT10=0,\"\",Pivots!AT10)","v":""},""]
[null,null,null,{"$f":"IF(ISBLANK(Pivots!AQ11),\"\",Pivots!AQ11)","v":""},{"$f":"IF(Pivots!AR11=0,\"\",Pivots!AR11)","v":""},{"$f":"IF(Pivots!AS11=0,\"\",Pivots!AS11)","v":""},{"$f":"IF(Pivots!AT11=0,\"\",Pivots!AT11)","v":""},""]
[null,null,null,{"$f":"IF(ISBLANK(Pivots!AQ12),\"\",Pivots!AQ12)","v":""},{"$f":"IF(Pivots!AR12=0,\"\",Pivots!AR12)","v":""},{"$f":"IF(Pivots!AS12=0,\"\",Pivots!AS12)","v":""},{"$f":"IF(Pivots!AT12=0,\"\",Pivots!AT12)","v":""},""]
[null,null,null,{"$f":"IF(ISBLANK(Pivots!AQ13),\"\",Pivots!AQ13)","v":""},{"$f":"IF(Pivots!AR13=0,\"\",Pivots!AR13)","v":""},{"$f":"IF(Pivots!AS13=0,\"\",Pivots!AS13)","v":""},{"$f":"IF(Pivots!AT13=0,\"\",Pivots!AT13)","v":""},""]
[null,null,null,{"$f":"IF(ISBLANK(Pivots!AQ14),\"\",Pivots!AQ14)","v":""},{"$f":"IF(Pivots!AR14=0,\"\",Pivots!AR14)","v":""},{"$f":"IF(Pivots!AS14=0,\"\",Pivots!AS14)","v":""},{"$f":"IF(Pivots!AT14=0,\"\",Pivots!AT14)","v":""},""]
[null,null,null,{"$f":"IF(ISBLANK(Pivots!AQ15),\"\",Pivots!AQ15)","v":""},{"$f":"IF(Pivots!AR15=0,\"\",Pivots!AR15)","v":""},{"$f":"IF(Pivots!AS15=0,\"\",Pivots!AS15)","v":""},{"$f":"IF(Pivots!AT15=0,\"\",Pivots!AT15)","v":""},""]
[null,null,null,{"$f":"IF(ISBLANK(Pivots!AQ16),\"\",Pivots!AQ16)","v":""},{"$f":"IF(Pivots!AR16=0,\"\",Pivots!AR16)","v":""},{"$f":"IF(Pivots!AS16=0,\"\",Pivots!AS16)","v":""},{"$f":"IF(Pivots!AT16=0,\"\",Pivots!AT16)","v":""},""]
[null,null,null,{"$f":"IF(ISBLANK(Pivots!AQ17),\"\",Pivots!AQ17)","v":""},{"$f":"IF(Pivots!AR17=0,\"\",Pivots!AR17)","v":""},{"$f":"IF(Pivots!AS17=0,\"\",Pivots!AS17)","v":""},{"$f":"IF(Pivots!AT17=0,\"\",Pivots!AT17)","v":""},""]
[null,null,null,{"$f":"IF(ISBLANK(Pivots!AQ18),\"\",Pivots!AQ18)","v":""},{"$f":"IF(Pivots!AR18=0,\"\",Pivots!AR18)","v":""},{"$f":"IF(Pivots!AS18=0,\"\",Pivots!AS18)","v":""},{"$f":"IF(Pivots!AT18=0,\"\",Pivots!AT18)","v":""},""]
[null,null,null,"Total",{"$f":"SUM(E55:E66)","v":16},{"$f":"SUM(F55:F66)","v":71.72},{"$f":"SUM(G55:G66)","v":-137.39749999999998},-8.5873437499999987]
[]
[]
[null,null,{"$f":"Pivots!G3","v":"Current Season"}]
[null,null,"Appearances","Total Butler","Relative Butler","Rel/ Match"]
[null,{"$f":"B9","v":"Dawes"},{"$f":"Extract!E14","v":5},{"$f":"Extract!F14","v":73.180000000000007},{"$f":"Extract!G14","v":-7.9699999999999989},{"$f":"IF(E72=\"\",\"\",E72/C72)","v":-1.5939999999999999}]
[null,{"$f":"B10","v":"Porter"},{"$f":"Extract!E15","v":""},{"$f":"Extract!F15","v":""},{"$f":"Extract!G15","v":""},{"$f":"IF(E73=\"\",\"\",E73/C73)","v":""}]
[null,{"$f":"B11","v":"Markham"},{"$f":"Extract!E16","v":""},{"$f":"Extract!F16","v":""},{"$f":"Extract!G16","v":""},""]
[]
[null,"Total",{"$f":"SUM(C72:C75)","v":5},{"$f":"SUM(D72:D75)","v":73.180000000000007},{"$f":"SUM(E72:E75)","v":-7.9699999999999989},{"$f":"IF(C76=0,\"\",E76/C76)","v":-1.5939999999999999}]

{"sheet":"Summary","index":1,"n_rows":26,"n_cols":21,"rows_kept":26,"cut":false,"hidden":false,"merged":[[1,3,1,6],[1,10,1,13],[1,17,1,20],[1,2,2,2],[1,9,2,9],[1,16,2,16]]}
[]
[null,"Dawes","Appearances","Relative Score per match",null,null,null,null,"Porter","Appearances","Relative Score per match",null,null,null,null,"Markham","Appearances","Relative Score per match"]
[null,"Player",null,"Overall","Dawes","Porter","Markham",null,"Player","Appearances","Overall","Dawes","Porter","Markham",null,"Player","Appearances","Overall","Dawes","Porter","Markham"]
[1,{"$f":"IF(ISNA(VLOOKUP($A4,Extract!$AC$4:$AJ$42,2,0)),\"\",VLOOKUP(VLOOKUP($A4,Extract!$AC$4:$AJ$42,2,0),Players!$A$2:$B$91,2))","v":"Patrick Shields"},{"$f":"IF(ISNA(VLOOKUP($A4,Extract!$AC$4:$AJ$42,2,0)),\"\",VLOOKUP($A4,Extract!$AC$4:$AJ$42,3,0))","v":"10D"},{"$f":"IF(ISNA(VLOOKUP($A4,Extract!$AC$4:$AJ$42,2,0)),\"\",VLOOKUP($A4,Extract!$AC$4:$AJ$42,4,0))","v":15.867250000000002},{"$f":"IF(ISNA(VLOOKUP($A4,Extract!$AC$4:$AJ$42,2,0)),\"\",VLOOKUP($A4,Extract!$AC$4:$AJ$42,5,0))","v":15.867250000000002},{"$f":"IF(ISNA(VLOOKUP($A4,Extract!$AC$4:$AJ$42,2,0)),\"\",VLOOKUP($A4,Extract!$AC$4:$AJ$42,6,0))","v":""},{"$f":"IF(ISNA(VLOOKUP($A4,Extract!$AC$4:$AJ$42,2,0)),\"\",VLOOKUP($A4,Extract!$AC$4:$AJ$42,7,0))","v":""},null,{"$f":"IF(ISNA(VLOOKUP($A4,Extract!$AL$4:$AS$40,2,0)),\"\",VLOOKUP(VLOOKUP($A4,Extract!$AL$4:$AS$40,2,0),Players!$A$2:$B$95,2))","v":"Patrick Phair"},{"$f":"IF(ISNA(VLOOKUP($A4,Extract!$AL$4:$AS$42,2,0)),\"\",VLOOKUP($A4,Extract!$AL$4:$AS$42,3,0))","v":"8P1M"},{"$f":"IF(ISNA(VLOOKUP($A4,Extract!$AL$4:$AS$42,2,0)),\"\",VLOOKUP($A4,Extract!$AL$4:$AS$42,4,0))","v":9.3197222222222216},{"$f":"IF(ISNA(VLOOKUP($A4,Extract!$AL$4:$AS$42,2,0)),\"\",VLOOKUP($A4,Extract!$AL$4:$AS$42,5,0))","v":""},{"$f":"IF(ISNA(VLOOKUP($A4,Extract!$AL$4:$AS$42,2,0)),\"\",VLOOKUP($A4,Extract!$AL$4:$AS$42,6,0))","v":10.1096875},{"$f":"IF(ISNA(VLOOKUP($A4,Extract!$AL$4:$AS$42,2,0)),\"\",VLOOKUP($A4,Extract!$AL$4:$AS$42,7,0))","v":3},null,{"$f":"IF(ISNA(VLOOKUP($A4,Extract!$AU$4:$BB$40,2,0)),\"\",VLOOKUP(VLOOKUP($A4,Extract!$AU$4:$BB$40,2,0),Players!$A$2:$B$95,2))","v":"Ben Ritacca"},{"$f":"IF(ISNA(VLOOKUP($A4,Extract!$AU$4:$BA$42,2,0)),\"\",VLOOKUP($A4,Extract!$AU$4:$BA$42,3,0))","v":"2P3M"},{"$f":"IF(ISNA(VLOOKUP($A4,Extract!$AU$4:$BA$42,2,0)),\"\",VLOOKUP($A4,Extract!$AU$4:$BA$42,4,0))","v":22.215},{"$f":"IF(ISNA(VLOOKUP($A4,Extract!$AU$4:$BA$42,2,0)),\"\",VLOOKUP($A4,Extract!$AU$4:$BA$42,5,0))","v":""},{"$f":"IF(ISNA(VLOOKUP($A4,Extract!$AU$4:$BA$42,2,0)),\"\",VLOOKUP($A4,Extract!$AU$4:$BA$42,6,0))","v":3.5374999999999996},{"$f":"IF(ISNA(VLOOKUP($A4,Extract!$AU$4:$BA$42,2,0)),\"\",VLOOKUP($A4,Extract!$AU$4:$BA$42,7,0))","v":34.666666666666664}]
[{"$f":"A4+1","v":2},{"$f":"IF(ISNA(VLOOKUP($A5,Extract!$AC$4:$AJ$42,2,0)),\"\",VLOOKUP(VLOOKUP($A5,Extract!$AC$4:$AJ$42,2,0),Players!$A$2:$B$91,2))","v":"Richard Chamberlain"},{"$f":"IF(ISNA(VLOOKUP($A5,Extract!$AC$4:$AJ$42,2,0)),\"\",VLOOKUP($A5,Extract!$AC$4:$AJ$42,3,0))","v":"10D"},{"$f":"IF(ISNA(VLOOKUP($A5,Extract!$AC$4:$AJ$42,2,0)),\"\",VLOOKUP($A5,Extract!$AC$4:$AJ$42,4,0))","v":10.817250000000001},{"$f":"IF(ISNA(VLOOKUP($A5,Extract!$AC$4:$AJ$42,2,0)),\"\",VLOOKUP($A5,Extract!$AC$4:$AJ$42,5,0))","v":10.817250000000001},{"$f":"IF(ISNA(VLOOKUP($A5,Extract!$AC$4:$AJ$42,2,0)),\"\",VLOOKUP($A5,Extract!$AC$4:$AJ$42,6,0))","v":""},{"$f":"IF(ISNA(VLOOKUP($A5,Extract!$AC$4:$AJ$42,2,0)),\"\",VLOOKUP($A5,Extract!$AC$4:$AJ$42,7,0))","v":""},null,{"$f":"IF(ISNA(VLOOKUP($A5,Extract!$AL$4:$AS$40,2,0)),\"\",VLOOKUP(VLOOKUP($A5,Extract!$AL$4:$AS$40,2,0),Players!$A$2:$B$95,2))","v":"Peter Swales"},{"$f":"IF(ISNA(VLOOKUP($A5,Extract!$AL$4:$AS$42,2,0)),\"\",VLOOKUP($A5,Extract!$AL$4:$AS$42,3,0))","v":"6P3M"},{"$f":"IF(ISNA(VLOOKUP($A5,Extract!$AL$4:$AS$42,2,0)),\"\",VLOOKUP($A5,Extract!$AL$4:$AS$42,4,0))","v":10.966111111111111},{"$f":"IF(ISNA(VLOOKUP($A5,Extract!$AL$4:$AS$42,2,0)),\"\",VLOOKUP($A5,Extract!$AL$4:$AS$42,5,0))","v":""},{"$f":"IF(ISNA(VLOOKUP($A5,Extract!$AL$4:$AS$42,2,0)),\"\",VLOOKUP($A5,Extract!$AL$4:$AS$42,6,0))","v":9.9491666666666667},{"$f":"IF(ISNA(VLOOKUP($A5,Extract!$AL$4:$AS$42,2,0)),\"\",VLOOKUP($A5,Extract!$AL$4:$AS$42,7,0))","v":13},null,{"$f":"IF(ISNA(VLOOKUP($A5,Extract!$AU$4:$BB$40,2,0)),\"\",VLOOKUP(VLOOKUP($A5,Extract!$AU$4:$BB$40,2,0),Players!$A$2:$B$95,2))","v":"Richard Harris"},{"$f":"IF(ISNA(VLOOKUP($A5,Extract!$AU$4:$BA$42,2,0)),\"\",VLOOKUP($A5,Extract!$AU$4:$BA$42,3,0))","v":"4P5M"},{"$f":"IF(ISNA(VLOOKUP($A5,Extract!$AU$4:$BA$42,2,0)),\"\",VLOOKUP($A5,Extract!$AU$4:$BA$42,4,0))","v":15.403055555555556},{"$f":"IF(ISNA(VLOOKUP($A5,Extract!$AU$4:$BA$42,2,0)),\"\",VLOOKUP($A5,Extract!$AU$4:$BA$42,5,0))","v":""},{"$f":"IF(ISNA(VLOOKUP($A5,Extract!$AU$4:$BA$42,2,0)),\"\",VLOOKUP($A5,Extract!$AU$4:$BA$42,6,0))","v":4.7062499999999998},{"$f":"IF(ISNA(VLOOKUP($A5,Extract!$AU$4:$BA$42,2,0)),\"\",VLOOKUP($A5,Extract!$AU$4:$BA$42,7,0))","v":23.960500000000003}]
[{"$f":"A5+1","v":3},{"$f":"IF(ISNA(VLOOKUP($A6,Extract!$AC$4:$AJ$42,2,0)),\"\",VLOOKUP(VLOOKUP($A6,Extract!$AC$4:$AJ$42,2,0),Players!$A$2:$B$91,2))","v":"John Atthey"},{"$f":"IF(ISNA(VLOOKUP($A6,Extract!$AC$4:$AJ$42,2,0)),\"\",VLOOKUP($A6,Extract!$AC$4:$AJ$42,3,0))","v":"4D"},{"$f":"IF(ISNA(VLOOKUP($A6,Extract!$AC$4:$AJ$42,2,0)),\"\",VLOOKUP($A6,Extract!$AC$4:$AJ$42,4,0))","v":9.2756250000000016},{"$f":"IF(ISNA(VLOOKUP($A6,Extract!$AC$4:$AJ$42,2,0)),\"\",VLOOKUP($A6,Extract!$AC$4:$AJ$42,5,0))","v":9.2756250000000016},{"$f":"IF(ISNA(VLOOKUP($A6,Extract!$AC$4:$AJ$42,2,0)),\"\",VLOOKUP($A6,Extract!$AC$4:$AJ$42,6,0))","v":""},{"$f":"IF(ISNA(VLOOKUP($A6,Extract!$AC$4:$AJ$42,2,0)),\"\",VLOOKUP($A6,Extract!$AC$4:$AJ$42,7,0))","v":""},null,{"$f":"IF(ISNA(VLOOKUP($A6,Extract!$AL$4:$AS$40,2,0)),\"\",VLOOKUP(VLOOKUP($A6,Extract!$AL$4:$AS$40,2,0),Players!$A$2:$B$95,2))","v":"Paul Lilley"},{"$f":"IF(ISNA(VLOOKUP($A6,Extract!$AL$4:$AS$42,2,0)),\"\",VLOOKUP($A6,Extract!$AL$4:$AS$42,3,0))","v":"6P3M"},{"$f":"IF(ISNA(VLOOKUP($A6,Extract!$AL$4:$AS$42,2,0)),\"\",VLOOKUP($A6,Extract!$AL$4:$AS$42,4,0))","v":10.966111111111111},{"$f":"IF(ISNA(VLOOKUP($A6,Extract!$AL$4:$AS$42,2,0)),\"\",VLOOKUP($A6,Extract!$AL$4:$AS$42,5,0))","v":""},{"$f":"IF(ISNA(VLOOKUP($A6,Extract!$AL$4:$AS$42,2,0)),\"\",VLOOKUP($A6,Extract!$AL$4:$AS$42,6,0))","v":9.9491666666666667},{"$f":"IF(ISNA(VLOOKUP($A6,Extract!$AL$4:$AS$42,2,0)),\"\",VLOOKUP($A6,Extract!$AL$4:$AS$42,7,0))","v":13},null,{"$f":"IF(ISNA(VLOOKUP($A6,Extract!$AU$4:$BB$40,2,0)),\"\",VLOOKUP(VLOOKUP($A6,Extract!$AU$4:$BB$40,2,0),Players!$A$2:$B$95,2))","v":"Tony Letts"},{"$f":"IF(ISNA(VLOOKUP($A6,Extract!$AU$4:$BA$42,2,0)),\"\",VLOOKUP($A6,Extract!$AU$4:$BA$42,3,0))","v":"4P5M"},{"$f":"IF(ISNA(VLOOKUP($A6,Extract!$AU$4:$BA$42,2,0)),\"\",VLOOKUP($A6,Extract!$AU$4:$BA$42,4,0))","v":8.8224999999999998},{"$f":"IF(ISNA(VLOOKUP($A6,Extract!$AU$4:$BA$42,2,0)),\"\",VLOOKUP($A6,Extract!$AU$4:$BA$42,5,0))","v":""},{"$f":"IF(ISNA(VLOOKUP($A6,Extract!$AU$4:$BA$42,2,0)),\"\",VLOOKUP($A6,Extract!$AU$4:$BA$42,6,0))","v":4.5},{"$f":"IF(ISNA(VLOOKUP($A6,Extract!$AU$4:$BA$42,2,0)),\"\",VLOOKUP($A6,Extract!$AU$4:$BA$42,7,0))","v":12.2805}]
[4,{"$f":"IF(ISNA(VLOOKUP($A7,Extract!$AC$4:$AJ$42,2,0)),\"\",VLOOKUP(VLOOKUP($A7,Extract!$AC$4:$AJ$42,2,0),Players!$A$2:$B$91,2))","v":"Claire Robinson"},{"$f":"IF(ISNA(VLOOKUP($A7,Extract!$AC$4:$AJ$42,2,0)),\"\",VLOOKUP($A7,Extract!$AC$4:$AJ$42,3,0))","v":"4D"},{"$f":"IF(ISNA(VLOOKUP($A7,Extract!$AC$4:$AJ$42,2,0)),\"\",VLOOKUP($A7,Extract!$AC$4:$AJ$42,4,0))","v":9.2756250000000016},{"$f":"IF(ISNA(VLOOKUP($A7,Extract!$AC$4:$AJ$42,2,0)),\"\",VLOOKUP($A7,Extract!$AC$4:$AJ$42,5,0))","v":9.2756250000000016},{"$f":"IF(ISNA(VLOOKUP($A7,Extract!$AC$4:$AJ$42,2,0)),\"\",VLOOKUP($A7,Extract!$AC$4:$AJ$42,6,0))","v":""},{"$f":"IF(ISNA(VLOOKUP($A7,Extract!$AC$4:$AJ$42,2,0)),\"\",VLOOKUP($A7,Extract!$AC$4:$AJ$42,7,0))","v":""},null,{"$f":"IF(ISNA(VLOOKUP($A7,Extract!$AL$4:$AS$40,2,0)),\"\",VLOOKUP(VLOOKUP($A7,Extract!$AL$4:$AS$40,2,0),Players!$A$2:$B$95,2))","v":"Jim Simons"},{"$f":"IF(ISNA(VLOOKUP($A7,Extract!$AL$4:$AS$42,2,0)),\"\",VLOOKUP($A7,Extract!$AL$4:$AS$42,3,0))","v":"7P5M"},{"$f":"IF(ISNA(VLOOKUP($A7,Extract!$AL$4:$AS$42,2,0)),\"\",VLOOKUP($A7,Extract!$AL$4:$AS$42,4,0))","v":0.37416666666666742},{"$f":"IF(ISNA(VLOOKUP($A7,Extract!$AL$4:$AS$42,2,0)),\"\",VLOOKUP($A7,Extract!$AL$4:$AS$42,5,0))","v":""},{"$f":"IF(ISNA(VLOOKUP($A7,Extract!$AL$4:$AS$42,2,0)),\"\",VLOOKUP($A7,Extract!$AL$4:$AS$42,6,0))","v":4.5375000000000005},{"$f":"IF(ISNA(VLOOKUP($A7,Extract!$AL$4:$AS$42,2,0)),\"\",VLOOKUP($A7,Extract!$AL$4:$AS$42,7,0))","v":-5.4544999999999986},null,{"$f":"IF(ISNA(VLOOKUP($A7,Extract!$AU$4:$BB$40,2,0)),\"\",VLOOKUP(VLOOKUP($A7,Extract!$AU$4:$BB$40,2,0),Players!$A$2:$B$95,2))","v":"Roger Schofield"},{"$f":"IF(ISNA(VLOOKUP($A7,Extract!$AU$4:$BA$42,2,0)),\"\",VLOOKUP($A7,Extract!$AU$4:$BA$42,3,0))","v":"4P5M"},{"$f":"IF(ISNA(VLOOKUP($A7,Extract!$AU$4:$BA$42,2,0)),\"\",VLOOKUP($A7,Extract!$AU$4:$BA$42,4,0))","v":8.8224999999999998},{"$f":"IF(ISNA(VLOOKUP($A7,Extract!$AU$4:$BA$42,2,0)),\"\",VLOOKUP($A7,Extract!$AU$4:$BA$42,5,0))","v":""},{"$f":"IF(ISNA(VLOOKUP($A7,Extract!$AU$4:$BA$42,2,0)),\"\",VLOOKUP($A7,Extract!$AU$4:$BA$42,6,0))","v":4.5},{"$f":"IF(ISNA(VLOOKUP($A7,Extract!$AU$4:$BA$42,2,0)),\"\",VLOOKUP($A7,Extract!$AU$4:$BA$42,7,0))","v":12.2805}]
[5,{"$f":"IF(ISNA(VLOOKUP($A8,Extract!$AC$4:$AJ$42,2,0)),\"\",VLOOKUP(VLOOKUP($A8,Extract!$AC$4:$AJ$42,2,0),Players!$A$2:$B$91,2))","v":"Paul Denning"},{"$f":"IF(ISNA(VLOOKUP($A8,Extract!$AC$4:$AJ$42,2,0)),\"\",VLOOKUP($A8,Extract!$AC$4:$AJ$42,3,0))","v":"12D"},{"$f":"IF(ISNA(VLOOKUP($A8,Extract!$AC$4:$AJ$42,2,0)),\"\",VLOOKUP($A8,Extract!$AC$4:$AJ$42,4,0))","v":8.1993749999999999},{"$f":"IF(ISNA(VLOOKUP($A8,Extract!$AC$4:$AJ$42,2,0)),\"\",VLOOKUP($A8,Extract!$AC$4:$AJ$42,5,0))","v":8.1993749999999999},{"$f":"IF(ISNA(VLOOKUP($A8,Extract!$AC$4:$AJ$42,2,0)),\"\",VLOOKUP($A8,Extract!$AC$4:$AJ$42,6,0))","v":""},{"$f":"IF(ISNA(VLOOKUP($A8,Extract!$AC$4:$AJ$42,2,0)),\"\",VLOOKUP($A8,Extract!$AC$4:$AJ$42,7,0))","v":""},null,{"$f":"IF(ISNA(VLOOKUP($A8,Extract!$AL$4:$AS$40,2,0)),\"\",VLOOKUP(VLOOKUP($A8,Extract!$AL$4:$AS$40,2,0),Players!$A$2:$B$95,2))","v":"Pam Pearce"},{"$f":"IF(ISNA(VLOOKUP($A8,Extract!$AL$4:$AS$42,2,0)),\"\",VLOOKUP($A8,Extract!$AL$4:$AS$42,3,0))","v":"6P"},{"$f":"IF(ISNA(VLOOKUP($A8,Extract!$AL$4:$AS$42,2,0)),\"\",VLOOKUP($A8,Extract!$AL$4:$AS$42,4,0))","v":2.875},{"$f":"IF(ISNA(VLOOKUP($A8,Extract!$AL$4:$AS$42,2,0)),\"\",VLOOKUP($A8,Extract!$AL$4:$AS$42,5,0))","v":""},{"$f":"IF(ISNA(VLOOKUP($A8,Extract!$AL$4:$AS$42,2,0)),\"\",VLOOKUP($A8,Extract!$AL$4:$AS$42,6,0))","v":2.875},{"$f":"IF(ISNA(VLOOKUP($A8,Extract!$AL$4:$AS$42,2,0)),\"\",VLOOKUP($A8,Extract!$AL$4:$AS$42,7,0))","v":""},null,{"$f":"IF(ISNA(VLOOKUP($A8,Extract!$AU$4:$BB$40,2,0)),\"\",VLOOKUP(VLOOKUP($A8,Extract!$AU$4:$BB$40,2,0),Players!$A$2:$B$95,2))","v":"Tricia Gilham"},{"$f":"IF(ISNA(VLOOKUP($A8,Extract!$AU$4:$BA$42,2,0)),\"\",VLOOKUP($A8,Extract!$AU$4:$BA$42,3,0))","v":"2P2M"},{"$f":"IF(ISNA(VLOOKUP($A8,Extract!$AU$4:$BA$42,2,0)),\"\",VLOOKUP($A8,Extract!$AU$4:$BA$42,4,0))","v":6.8881250000000005},{"$f":"IF(ISNA(VLOOKUP($A8,Extract!$AU$4:$BA$42,2,0)),\"\",VLOOKUP($A8,Extract!$AU$4:$BA$42,5,0))","v":""},{"$f":"IF(ISNA(VLOOKUP($A8,Extract!$AU$4:$BA$42,2,0)),\"\",VLOOKUP($A8,Extract!$AU$4:$BA$42,6,0))","v":5.875},{"$f":"IF(ISNA(VLOOKUP($A8,Extract!$AU$4:$BA$42,2,0)),\"\",VLOOKUP($A8,Extract!$AU$4:$BA$42,7,0))","v":7.901250000000001}]
[6,{"$f":"IF(ISNA(VLOOKUP($A9,Extract!$AC$4:$AJ$42,2,0)),\"\",VLOOKUP(VLOOKUP($A9,Extract!$AC$4:$AJ$42,2,0),Players!$A$2:$B$91,2))","v":"Richard Plackett"},{"$f":"IF(ISNA(VLOOKUP($A9,Extract!$AC$4:$AJ$42,2,0)),\"\",VLOOKUP($A9,Extract!$AC$4:$AJ$42,3,0))","v":"11D"},{"$f":"IF(ISNA(VLOOKUP($A9,Extract!$AC$4:$AJ$42,2,0)),\"\",VLOOKUP($A9,Extract!$AC$4:$AJ$42,4,0))","v":5.7856818181818177},{"$f":"IF(ISNA(VLOOKUP($A9,Extract!$AC$4:$AJ$42,2,0)),\"\",VLOOKUP($A9,Extract!$AC$4:$AJ$42,5,0))","v":5.7856818181818177},{"$f":"IF(ISNA(VLOOKUP($A9,Extract!$AC$4:$AJ$42,2,0)),\"\",VLOOKUP($A9,Extract!$AC$4:$AJ$42,6,0))","v":""},{"$f":"IF(ISNA(VLOOKUP($A9,Extract!$AC$4:$AJ$42,2,0)),\"\",VLOOKUP($A9,Extract!$AC$4:$AJ$42,7,0))","v":""},null,{"$f":"IF(ISNA(VLOOKUP($A9,Extract!$AL$4:$AS$40,2,0)),\"\",VLOOKUP(VLOOKUP($A9,Extract!$AL$4:$AS$40,2,0),Players!$A$2:$B$95,2))","v":"Mike Wignall"},{"$f":"IF(ISNA(VLOOKUP($A9,Extract!$AL$4:$AS$42,2,0)),\"\",VLOOKUP($A9,Extract!$AL$4:$AS$42,3,0))","v":"7P2M"},{"$f":"IF(ISNA(VLOOKUP($A9,Extract!$AL$4:$AS$42,2,0)),\"\",VLOOKUP($A9,Extract!$AL$4:$AS$42,4,0))","v":-1.0469444444444445},{"$f":"IF(ISNA(VLOOKUP($A9,Extract!$AL$4:$AS$42,2,0)),\"\",VLOOKUP($A9,Extract!$AL$4:$AS$42,5,0))","v":""},{"$f":"IF(ISNA(VLOOKUP($A9,Extract!$AL$4:$AS$42,2,0)),\"\",VLOOKUP($A9,Extract!$AL$4:$AS$42,6,0))","v":-1.774642857142857},{"$f":"IF(ISNA(VLOOKUP($A9,Extract!$AL$4:$AS$42,2,0)),\"\",VLOOKUP($A9,Extract!$AL$4:$AS$42,7,0))","v":1.5},null,{"$f":"IF(ISNA(VLOOKUP($A9,Extract!$AU$4:$BB$40,2,0)),\"\",VLOOKUP(VLOOKUP($A9,Extract!$AU$4:$BB$40,2,0),Players!$A$2:$B$95,2))","v":"Roger Jackson"},{"$f":"IF(ISNA(VLOOKUP($A9,Extract!$AU$4:$BA$42,2,0)),\"\",VLOOKUP($A9,Extract!$AU$4:$BA$42,3,0))","v":"11M"},{"$f":"IF(ISNA(VLOOKUP($A9,Extract!$AU$4:$BA$42,2,0)),\"\",VLOOKUP($A9,Extract!$AU$4:$BA$42,4,0))","v":0.38272727272727347},{"$f":"IF(ISNA(VLOOKUP($A9,Extract!$AU$4:$BA$42,2,0)),\"\",VLOOKUP($A9,Extract!$AU$4:$BA$42,5,0))","v":""},{"$f":"IF(ISNA(VLOOKUP($A9,Extract!$AU$4:$BA$42,2,0)),\"\",VLOOKUP($A9,Extract!$AU$4:$BA$42,6,0))","v":""},{"$f":"IF(ISNA(VLOOKUP($A9,Extract!$AU$4:$BA$42,2,0)),\"\",VLOOKUP($A9,Extract!$AU$4:$BA$42,7,0))","v":0.38272727272727347}]
[7,{"$f":"IF(ISNA(VLOOKUP($A10,Extract!$AC$4:$AJ$42,2,0)),\"\",VLOOKUP(VLOOKUP($A10,Extract!$AC$4:$AJ$42,2,0),Players!$A$2:$B$91,2))","v":"Keith Stanley"},{"$f":"IF(ISNA(VLOOKUP($A10,Extract!$AC$4:$AJ$42,2,0)),\"\",VLOOKUP($A10,Extract!$AC$4:$AJ$42,3,0))","v":"7D1P"},{"$f":"IF(ISNA(VLOOKUP($A10,Extract!$AC$4:$AJ$42,2,0)),\"\",VLOOKUP($A10,Extract!$AC$4:$AJ$42,4,0))","v":0.68156250000000007},{"$f":"IF(ISNA(VLOOKUP($A10,Extract!$AC$4:$AJ$42,2,0)),\"\",VLOOKUP($A10,Extract!$AC$4:$AJ$42,5,0))","v":-3.11},{"$f":"IF(ISNA(VLOOKUP($A10,Extract!$AC$4:$AJ$42,2,0)),\"\",VLOOKUP($A10,Extract!$AC$4:$AJ$42,6,0))","v":27.2225},{"$f":"IF(ISNA(VLOOKUP($A10,Extract!$AC$4:$AJ$42,2,0)),\"\",VLOOKUP($A10,Extract!$AC$4:$AJ$42,7,0))","v":""},null,{"$f":"IF(ISNA(VLOOKUP($A10,Extract!$AL$4:$AS$40,2,0)),\"\",VLOOKUP(VLOOKUP($A10,Extract!$AL$4:$AS$40,2,0),Players!$A$2:$B$95,2))","v":"Val Constable"},{"$f":"IF(ISNA(VLOOKUP($A10,Extract!$AL$4:$AS$42,2,0)),\"\",VLOOKUP($A10,Extract!$AL$4:$AS$42,3,0))","v":"2P4M"},{"$f":"IF(ISNA(VLOOKUP($A10,Extract!$AL$4:$AS$42,2,0)),\"\",VLOOKUP($A10,Extract!$AL$4:$AS$42,4,0))","v":0.74625000000000108},{"$f":"IF(ISNA(VLOOKUP($A10,Extract!$AL$4:$AS$42,2,0)),\"\",VLOOKUP($A10,Extract!$AL$4:$AS$42,5,0))","v":""},{"$f":"IF(ISNA(VLOOKUP($A10,Extract!$AL$4:$AS$42,2,0)),\"\",VLOOKUP($A10,Extract!$AL$4:$AS$42,6,0))","v":-2.375},{"$f":"IF(ISNA(VLOOKUP($A10,Extract!$AL$4:$AS$42,2,0)),\"\",VLOOKUP($A10,Extract!$AL$4:$AS$42,7,0))","v":2.3068750000000016},null,{"$f":"IF(ISNA(VLOOKUP($A10,Extract!$AU$4:$BB$40,2,0)),\"\",VLOOKUP(VLOOKUP($A10,Extract!$AU$4:$BB$40,2,0),Players!$A$2:$B$95,2))","v":"Peter Waggett"},{"$f":"IF(ISNA(VLOOKUP($A10,Extract!$AU$4:$BA$42,2,0)),\"\",VLOOKUP($A10,Extract!$AU$4:$BA$42,3,0))","v":"1P11M"},{"$f":"IF(ISNA(VLOOKUP($A10,Extract!$AU$4:$BA$42,2,0)),\"\",VLOOKUP($A10,Extract!$AU$4:$BA$42,4,0))","v":-0.27416666666666673},{"$f":"IF(ISNA(VLOOKUP($A10,Extract!$AU$4:$BA$42,2,0)),\"\",VLOOKUP($A10,Extract!$AU$4:$BA$42,5,0))","v":""},{"$f":"IF(ISNA(VLOOKUP($A10,Extract!$AU$4:$BA$42,2,0)),\"\",VLOOKUP($A10,Extract!$AU$4:$BA$42,6,0))","v":-7.5},{"$f":"IF(ISNA(VLOOKUP($A10,Extract!$AU$4:$BA$42,2,0)),\"\",VLOOKUP($A10,Extract!$AU$4:$BA$42,7,0))","v":0.38272727272727264}]
[8,{"$f":"IF(ISNA(VLOOKUP($A11,Extract!$AC$4:$AJ$42,2,0)),\"\",VLOOKUP(VLOOKUP($A11,Extract!$AC$4:$AJ$42,2,0),Players!$A$2:$B$91,2))","v":"Richard Butland"},{"$f":"IF(ISNA(VLOOKUP($A11,Extract!$AC$4:$AJ$42,2,0)),\"\",VLOOKUP($A11,Extract!$AC$4:$AJ$42,3,0))","v":"11D"},{"$f":"IF(ISNA(VLOOKUP($A11,Extract!$AC$4:$AJ$42,2,0)),\"\",VLOOKUP($A11,Extract!$AC$4:$AJ$42,4,0))","v":-6.1724999999999994},{"$f":"IF(ISNA(VLOOKUP($A11,Extract!$AC$4:$AJ$42,2,0)),\"\",VLOOKUP($A11,Extract!$AC$4:$AJ$42,5,0))","v":-6.1724999999999994},{"$f":"IF(ISNA(VLOOKUP($A11,Extract!$AC$4:$AJ$42,2,0)),\"\",VLOOKUP($A11,Extract!$AC$4:$AJ$42,6,0))","v":""},{"$f":"IF(ISNA(VLOOKUP($A11,Extract!$AC$4:$AJ$42,2,0)),\"\",VLOOKUP($A11,Extract!$AC$4:$AJ$42,7,0))","v":""},null,{"$f":"IF(ISNA(VLOOKUP($A11,Extract!$AL$4:$AS$40,2,0)),\"\",VLOOKUP(VLOOKUP($A11,Extract!$AL$4:$AS$40,2,0),Players!$A$2:$B$95,2))","v":"John Councer"},{"$f":"IF(ISNA(VLOOKUP($A11,Extract!$AL$4:$AS$42,2,0)),\"\",VLOOKUP($A11,Extract!$AL$4:$AS$42,3,0))","v":"1D8P"},{"$f":"IF(ISNA(VLOOKUP($A11,Extract!$AL$4:$AS$42,2,0)),\"\",VLOOKUP($A11,Extract!$AL$4:$AS$42,4,0))","v":-2.9813888888888891},{"$f":"IF(ISNA(VLOOKUP($A11,Extract!$AL$4:$AS$42,2,0)),\"\",VLOOKUP($A11,Extract!$AL$4:$AS$42,5,0))","v":-6.75},{"$f":"IF(ISNA(VLOOKUP($A11,Extract!$AL$4:$AS$42,2,0)),\"\",VLOOKUP($A11,Extract!$AL$4:$AS$42,6,0))","v":-2.5103125000000004},{"$f":"IF(ISNA(VLOOKUP($A11,Extract!$AL$4:$AS$42,2,0)),\"\",VLOOKUP($A11,Extract!$AL$4:$AS$42,7,0))","v":""},null,{"$f":"IF(ISNA(VLOOKUP($A11,Extract!$AU$4:$BB$40,2,0)),\"\",VLOOKUP(VLOOKUP($A11,Extract!$AU$4:$BB$40,2,0),Players!$A$2:$B$95,2))","v":"David Atthey"},{"$f":"IF(ISNA(VLOOKUP($A11,Extract!$AU$4:$BA$42,2,0)),\"\",VLOOKUP($A11,Extract!$AU$4:$BA$42,3,0))","v":"4M"},{"$f":"IF(ISNA(VLOOKUP($A11,Extract!$AU$4:$BA$42,2,0)),\"\",VLOOKUP($A11,Extract!$AU$4:$BA$42,4,0))","v":-3.25},{"$f":"IF(ISNA(VLOOKUP($A11,Extract!$AU$4:$BA$42,2,0)),\"\",VLOOKUP($A11,Extract!$AU$4:$BA$42,5,0))","v":""},{"$f":"IF(ISNA(VLOOKUP($A11,Extract!$AU$4:$BA$42,2,0)),\"\",VLOOKUP($A11,Extract!$AU$4:$BA$42,6,0))","v":""},{"$f":"IF(ISNA(VLOOKUP($A11,Extract!$AU$4:$BA$42,2,0)),\"\",VLOOKUP($A11,Extract!$AU$4:$BA$42,7,0))","v":-3.25}]
[9,{"$f":"IF(ISNA(VLOOKUP($A12,Extract!$AC$4:$AJ$42,2,0)),\"\",VLOOKUP(VLOOKUP($A12,Extract!$AC$4:$AJ$42,2,0),Players!$A$2:$B$91,2))","v":"Gary Watson"},{"$f":"IF(ISNA(VLOOKUP($A12,Extract!$AC$4:$AJ$42,2,0)),\"\",VLOOKUP($A12,Extract!$AC$4:$AJ$42,3,0))","v":"10D"},{"$f":"IF(ISNA(VLOOKUP($A12,Extract!$AC$4:$AJ$42,2,0)),\"\",VLOOKUP($A12,Extract!$AC$4:$AJ$42,4,0))","v":-10.66475},{"$f":"IF(ISNA(VLOOKUP($A12,Extract!$AC$4:$AJ$42,2,0)),\"\",VLOOKUP($A12,Extract!$AC$4:$AJ$42,5,0))","v":-10.66475},{"$f":"IF(ISNA(VLOOKUP($A12,Extract!$AC$4:$AJ$42,2,0)),\"\",VLOOKUP($A12,Extract!$AC$4:$AJ$42,6,0))","v":""},{"$f":"IF(ISNA(VLOOKUP($A12,Extract!$AC$4:$AJ$42,2,0)),\"\",VLOOKUP($A12,Extract!$AC$4:$AJ$42,7,0))","v":""},null,{"$f":"IF(ISNA(VLOOKUP($A12,Extract!$AL$4:$AS$40,2,0)),\"\",VLOOKUP(VLOOKUP($A12,Extract!$AL$4:$AS$40,2,0),Players!$A$2:$B$95,2))","v":"Roy Collard"},{"$f":"IF(ISNA(VLOOKUP($A12,Extract!$AL$4:$AS$42,2,0)),\"\",VLOOKUP($A12,Extract!$AL$4:$AS$42,3,0))","v":"7P"},{"$f":"IF(ISNA(VLOOKUP($A12,Extract!$AL$4:$AS$42,2,0)),\"\",VLOOKUP($A12,Extract!$AL$4:$AS$42,4,0))","v":-5.9642857142857144},{"$f":"IF(ISNA(VLOOKUP($A12,Extract!$AL$4:$AS$42,2,0)),\"\",VLOOKUP($A12,Extract!$AL$4:$AS$42,5,0))","v":""},{"$f":"IF(ISNA(VLOOKUP($A12,Extract!$AL$4:$AS$42,2,0)),\"\",VLOOKUP($A12,Extract!$AL$4:$AS$42,6,0))","v":-5.9642857142857144},{"$f":"IF(ISNA(VLOOKUP($A12,Extract!$AL$4:$AS$42,2,0)),\"\",VLOOKUP($A12,Extract!$AL$4:$AS$42,7,0))","v":""},null,{"$f":"IF(ISNA(VLOOKUP($A12,Extract!$AU$4:$BB$40,2,0)),\"\",VLOOKUP(VLOOKUP($A12,Extract!$AU$4:$BB$40,2,0),Players!$A$2:$B$95,2))","v":"Alison Pritchard"},{"$f":"IF(ISNA(VLOOKUP($A12,Extract!$AU$4:$BA$42,2,0)),\"\",VLOOKUP($A12,Extract!$AU$4:$BA$42,3,0))","v":"4M"},{"$f":"IF(ISNA(VLOOKUP($A12,Extract!$AU$4:$BA$42,2,0)),\"\",VLOOKUP($A12,Extract!$AU$4:$BA$42,4,0))","v":-3.25},{"$f":"IF(ISNA(VLOOKUP($A12,Extract!$AU$4:$BA$42,2,0)),\"\",VLOOKUP($A12,Extract!$AU$4:$BA$42,5,0))","v":""},{"$f":"IF(ISNA(VLOOKUP($A12,Extract!$AU$4:$BA$42,2,0)),\"\",VLOOKUP($A12,Extract!$AU$4:$BA$42,6,0))","v":""},{"$f":"IF(ISNA(VLOOKUP($A12,Extract!$AU$4:$BA$42,2,0)),\"\",VLOOKUP($A12,Extract!$AU$4:$BA$42,7,0))","v":-3.25}]
[10,{"$f":"IF(ISNA(VLOOKUP($A13,Extract!$AC$4:$AJ$42,2,0)),\"\",VLOOKUP(VLOOKUP($A13,Extract!$AC$4:$AJ$42,2,0),Players!$A$2:$B$91,2))","v":"Joe Angseesing"},{"$f":"IF(ISNA(VLOOKUP($A13,Extract!$AC$4:$AJ$42,2,0)),\"\",VLOOKUP($A13,Extract!$AC$4:$AJ$42,3,0))","v":"8D1P"},{"$f":"IF(ISNA(VLOOKUP($A13,Extract!$AC$4:$AJ$42,2,0)),\"\",VLOOKUP($A13,Extract!$AC$4:$AJ$42,4,0))","v":-7.9219444444444447},{"$f":"IF(ISNA(VLOOKUP($A13,Extract!$AC$4:$AJ$42,2,0)),\"\",VLOOKUP($A13,Extract!$AC$4:$AJ$42,5,0))","v":-12.315},{"$f":"IF(ISNA(VLOOKUP($A13,Extract!$AC$4:$AJ$42,2,0)),\"\",VLOOKUP($A13,Extract!$AC$4:$AJ$42,6,0))","v":27.2225},{"$f":"IF(ISNA(VLOOKUP($A13,Extract!$AC$4:$AJ$42,2,0)),\"\",VLOOKUP($A13,Extract!$AC$4:$AJ$42,7,0))","v":""},null,{"$f":"IF(ISNA(VLOOKUP($A13,Extract!$AL$4:$AS$40,2,0)),\"\",VLOOKUP(VLOOKUP($A13,Extract!$AL$4:$AS$40,2,0),Players!$A$2:$B$95,2))","v":"Mark Rogers"},{"$f":"IF(ISNA(VLOOKUP($A13,Extract!$AL$4:$AS$42,2,0)),\"\",VLOOKUP($A13,Extract!$AL$4:$AS$42,3,0))","v":"1D9P"},{"$f":"IF(ISNA(VLOOKUP($A13,Extract!$AL$4:$AS$42,2,0)),\"\",VLOOKUP($A13,Extract!$AL$4:$AS$42,4,0))","v":-8.5832499999999996},{"$f":"IF(ISNA(VLOOKUP($A13,Extract!$AL$4:$AS$42,2,0)),\"\",VLOOKUP($A13,Extract!$AL$4:$AS$42,5,0))","v":-6.75},{"$f":"IF(ISNA(VLOOKUP($A13,Extract!$AL$4:$AS$42,2,0)),\"\",VLOOKUP($A13,Extract!$AL$4:$AS$42,6,0))","v":-8.7869444444444458},{"$f":"IF(ISNA(VLOOKUP($A13,Extract!$AL$4:$AS$42,2,0)),\"\",VLOOKUP($A13,Extract!$AL$4:$AS$42,7,0))","v":""},null,{"$f":"IF(ISNA(VLOOKUP($A13,Extract!$AU$4:$BB$40,2,0)),\"\",VLOOKUP(VLOOKUP($A13,Extract!$AU$4:$BB$40,2,0),Players!$A$2:$B$95,2))","v":"Anne Swannell"},{"$f":"IF(ISNA(VLOOKUP($A13,Extract!$AU$4:$BA$42,2,0)),\"\",VLOOKUP($A13,Extract!$AU$4:$BA$42,3,0))","v":"2M"},{"$f":"IF(ISNA(VLOOKUP($A13,Extract!$AU$4:$BA$42,2,0)),\"\",VLOOKUP($A13,Extract!$AU$4:$BA$42,4,0))","v":-4.6587499999999995},{"$f":"IF(ISNA(VLOOKUP($A13,Extract!$AU$4:$BA$42,2,0)),\"\",VLOOKUP($A13,Extract!$AU$4:$BA$42,5,0))","v":""},{"$f":"IF(ISNA(VLOOKUP($A13,Extract!$AU$4:$BA$42,2,0)),\"\",VLOOKUP($A13,Extract!$AU$4:$BA$42,6,0))","v":""},{"$f":"IF(ISNA(VLOOKUP($A13,Extract!$AU$4:$BA$42,2,0)),\"\",VLOOKUP($A13,Extract!$AU$4:$BA$42,7,0))","v":-4.6587499999999995}]
[11,{"$f":"IF(ISNA(VLOOKUP($A14,Extract!$AC$4:$AJ$42,2,0)),\"\",VLOOKUP(VLOOKUP($A14,Extract!$AC$4:$AJ$42,2,0),Players!$A$2:$B$91,2))","v":"Andrew Kambites"},{"$f":"IF(ISNA(VLOOKUP($A14,Extract!$AC$4:$AJ$42,2,0)),\"\",VLOOKUP($A14,Extract!$AC$4:$AJ$42,3,0))","v":"1D"},{"$f":"IF(ISNA(VLOOKUP($A14,Extract!$AC$4:$AJ$42,2,0)),\"\",VLOOKUP($A14,Extract!$AC$4:$AJ$42,4,0))","v":-21.5},{"$f":"IF(ISNA(VLOOKUP($A14,Extract!$AC$4:$AJ$42,2,0)),\"\",VLOOKUP($A14,Extract!$AC$4:$AJ$42,5,0))","v":-21.5},{"$f":"IF(ISNA(VLOOKUP($A14,Extract!$AC$4:$AJ$42,2,0)),\"\",VLOOKUP($A14,Extract!$AC$4:$AJ$42,6,0))","v":""},{"$f":"IF(ISNA(VLOOKUP($A14,Extract!$AC$4:$AJ$42,2,0)),\"\",VLOOKUP($A14,Extract!$AC$4:$AJ$42,7,0))","v":""},null,{"$f":"IF(ISNA(VLOOKUP($A14,Extract!$AL$4:$AS$40,2,0)),\"\",VLOOKUP(VLOOKUP($A14,Extract!$AL$4:$AS$40,2,0),Players!$A$2:$B$95,2))","v":"Wendy Angseesing"},{"$f":"IF(ISNA(VLOOKUP($A14,Extract!$AL$4:$AS$42,2,0)),\"\",VLOOKUP($A14,Extract!$AL$4:$AS$42,3,0))","v":"1D3P1M"},{"$f":"IF(ISNA(VLOOKUP($A14,Extract!$AL$4:$AS$42,2,0)),\"\",VLOOKUP($A14,Extract!$AL$4:$AS$42,4,0))","v":-17.7075},{"$f":"IF(ISNA(VLOOKUP($A14,Extract!$AL$4:$AS$42,2,0)),\"\",VLOOKUP($A14,Extract!$AL$4:$AS$42,5,0))","v":-39.25},{"$f":"IF(ISNA(VLOOKUP($A14,Extract!$AL$4:$AS$42,2,0)),\"\",VLOOKUP($A14,Extract!$AL$4:$AS$42,6,0))","v":-16.429166666666664},{"$f":"IF(ISNA(VLOOKUP($A14,Extract!$AL$4:$AS$42,2,0)),\"\",VLOOKUP($A14,Extract!$AL$4:$AS$42,7,0))","v":0},null,{"$f":"IF(ISNA(VLOOKUP($A14,Extract!$AU$4:$BB$40,2,0)),\"\",VLOOKUP(VLOOKUP($A14,Extract!$AU$4:$BB$40,2,0),Players!$A$2:$B$95,2))","v":"Roger Williams"},{"$f":"IF(ISNA(VLOOKUP($A14,Extract!$AU$4:$BA$42,2,0)),\"\",VLOOKUP($A14,Extract!$AU$4:$BA$42,3,0))","v":"3M"},{"$f":"IF(ISNA(VLOOKUP($A14,Extract!$AU$4:$BA$42,2,0)),\"\",VLOOKUP($A14,Extract!$AU$4:$BA$42,4,0))","v":-11.939166666666665},{"$f":"IF(ISNA(VLOOKUP($A14,Extract!$AU$4:$BA$42,2,0)),\"\",VLOOKUP($A14,Extract!$AU$4:$BA$42,5,0))","v":""},{"$f":"IF(ISNA(VLOOKUP($A14,Extract!$AU$4:$BA$42,2,0)),\"\",VLOOKUP($A14,Extract!$AU$4:$BA$42,6,0))","v":""},{"$f":"IF(ISNA(VLOOKUP($A14,Extract!$AU$4:$BA$42,2,0)),\"\",VLOOKUP($A14,Extract!$AU$4:$BA$42,7,0))","v":-11.939166666666665}]
[12,{"$f":"IF(ISNA(VLOOKUP($A15,Extract!$AC$4:$AJ$42,2,0)),\"\",VLOOKUP(VLOOKUP($A15,Extract!$AC$4:$AJ$42,2,0),Players!$A$2:$B$91,2))","v":"Tony Hill"},{"$f":"IF(ISNA(VLOOKUP($A15,Extract!$AC$4:$AJ$42,2,0)),\"\",VLOOKUP($A15,Extract!$AC$4:$AJ$42,3,0))","v":"2D1P"},{"$f":"IF(ISNA(VLOOKUP($A15,Extract!$AC$4:$AJ$42,2,0)),\"\",VLOOKUP($A15,Extract!$AC$4:$AJ$42,4,0))","v":-25.166666666666668},{"$f":"IF(ISNA(VLOOKUP($A15,Extract!$AC$4:$AJ$42,2,0)),\"\",VLOOKUP($A15,Extract!$AC$4:$AJ$42,5,0))","v":-23.875},{"$f":"IF(ISNA(VLOOKUP($A15,Extract!$AC$4:$AJ$42,2,0)),\"\",VLOOKUP($A15,Extract!$AC$4:$AJ$42,6,0))","v":-27.75},{"$f":"IF(ISNA(VLOOKUP($A15,Extract!$AC$4:$AJ$42,2,0)),\"\",VLOOKUP($A15,Extract!$AC$4:$AJ$42,7,0))","v":""},null,{"$f":"IF(ISNA(VLOOKUP($A15,Extract!$AL$4:$AS$40,2,0)),\"\",VLOOKUP(VLOOKUP($A15,Extract!$AL$4:$AS$40,2,0),Players!$A$2:$B$95,2))","v":"Mel Barlow"},{"$f":"IF(ISNA(VLOOKUP($A15,Extract!$AL$4:$AS$42,2,0)),\"\",VLOOKUP($A15,Extract!$AL$4:$AS$42,3,0))","v":"3P3M"},{"$f":"IF(ISNA(VLOOKUP($A15,Extract!$AL$4:$AS$42,2,0)),\"\",VLOOKUP($A15,Extract!$AL$4:$AS$42,4,0))","v":-13.573749999999999},{"$f":"IF(ISNA(VLOOKUP($A15,Extract!$AL$4:$AS$42,2,0)),\"\",VLOOKUP($A15,Extract!$AL$4:$AS$42,5,0))","v":""},{"$f":"IF(ISNA(VLOOKUP($A15,Extract!$AL$4:$AS$42,2,0)),\"\",VLOOKUP($A15,Extract!$AL$4:$AS$42,6,0))","v":-17.833333333333332},{"$f":"IF(ISNA(VLOOKUP($A15,Extract!$AL$4:$AS$42,2,0)),\"\",VLOOKUP($A15,Extract!$AL$4:$AS$42,7,0))","v":-9.3141666666666652},null,{"$f":"IF(ISNA(VLOOKUP($A15,Extract!$AU$4:$BB$40,2,0)),\"\",VLOOKUP(VLOOKUP($A15,Extract!$AU$4:$BB$40,2,0),Players!$A$2:$B$95,2))","v":"Judy Sanis"},{"$f":"IF(ISNA(VLOOKUP($A15,Extract!$AU$4:$BA$42,2,0)),\"\",VLOOKUP($A15,Extract!$AU$4:$BA$42,3,0))","v":"4M"},{"$f":"IF(ISNA(VLOOKUP($A15,Extract!$AU$4:$BA$42,2,0)),\"\",VLOOKUP($A15,Extract!$AU$4:$BA$42,4,0))","v":-12.595624999999998},{"$f":"IF(ISNA(VLOOKUP($A15,Extract!$AU$4:$BA$42,2,0)),\"\",VLOOKUP($A15,Extract!$AU$4:$BA$42,5,0))","v":""},{"$f":"IF(ISNA(VLOOKUP($A15,Extract!$AU$4:$BA$42,2,0)),\"\",VLOOKUP($A15,Extract!$AU$4:$BA$42,6,0))","v":""},{"$f":"IF(ISNA(VLOOKUP($A15,Extract!$AU$4:$BA$42,2,0)),\"\",VLOOKUP($A15,Extract!$AU$4:$BA$42,7,0))","v":-12.595624999999998}]
[13,{"$f":"IF(ISNA(VLOOKUP($A16,Extract!$AC$4:$AJ$42,2,0)),\"\",VLOOKUP(VLOOKUP($A16,Extract!$AC$4:$AJ$42,2,0),Players!$A$2:$B$91,2))","v":"Alan Wearmouth"},{"$f":"IF(ISNA(VLOOKUP($A16,Extract!$AC$4:$AJ$42,2,0)),\"\",VLOOKUP($A16,Extract!$AC$4:$AJ$42,3,0))","v":"2D1P"},{"$f":"IF(ISNA(VLOOKUP($A16,Extract!$AC$4:$AJ$42,2,0)),\"\",VLOOKUP($A16,Extract!$AC$4:$AJ$42,4,0))","v":-25.166666666666668},{"$f":"IF(ISNA(VLOOKUP($A16,Extract!$AC$4:$AJ$42,2,0)),\"\",VLOOKUP($A16,Extract!$AC$4:$AJ$42,5,0))","v":-23.875},{"$f":"IF(ISNA(VLOOKUP($A16,Extract!$AC$4:$AJ$42,2,0)),\"\",VLOOKUP($A16,Extract!$AC$4:$AJ$42,6,0))","v":-27.75},{"$f":"IF(ISNA(VLOOKUP($A16,Extract!$AC$4:$AJ$42,2,0)),\"\",VLOOKUP($A16,Extract!$AC$4:$AJ$42,7,0))","v":""},null,{"$f":"IF(ISNA(VLOOKUP($A16,Extract!$AL$4:$AS$40,2,0)),\"\",VLOOKUP(VLOOKUP($A16,Extract!$AL$4:$AS$40,2,0),Players!$A$2:$B$95,2))","v":"John Arblaster"},{"$f":"IF(ISNA(VLOOKUP($A16,Extract!$AL$4:$AS$42,2,0)),\"\",VLOOKUP($A16,Extract!$AL$4:$AS$42,3,0))","v":"3P2M"},{"$f":"IF(ISNA(VLOOKUP($A16,Extract!$AL$4:$AS$42,2,0)),\"\",VLOOKUP($A16,Extract!$AL$4:$AS$42,4,0))","v":-10.1},{"$f":"IF(ISNA(VLOOKUP($A16,Extract!$AL$4:$AS$42,2,0)),\"\",VLOOKUP($A16,Extract!$AL$4:$AS$42,5,0))","v":""},{"$f":"IF(ISNA(VLOOKUP($A16,Extract!$AL$4:$AS$42,2,0)),\"\",VLOOKUP($A16,Extract!$AL$4:$AS$42,6,0))","v":-17.833333333333332},{"$f":"IF(ISNA(VLOOKUP($A16,Extract!$AL$4:$AS$42,2,0)),\"\",VLOOKUP($A16,Extract!$AL$4:$AS$42,7,0))","v":1.5},null,{"$f":"IF(ISNA(VLOOKUP($A16,Extract!$AU$4:$BB$40,2,0)),\"\",VLOOKUP(VLOOKUP($A16,Extract!$AU$4:$BB$40,2,0),Players!$A$2:$B$95,2))","v":"Allan Sanis"},{"$f":"IF(ISNA(VLOOKUP($A16,Extract!$AU$4:$BA$42,2,0)),\"\",VLOOKUP($A16,Extract!$AU$4:$BA$42,3,0))","v":"1D5M"},{"$f":"IF(ISNA(VLOOKUP($A16,Extract!$AU$4:$BA$42,2,0)),\"\",VLOOKUP($A16,Extract!$AU$4:$BA$42,4,0))","v":-20.897083333333331},{"$f":"IF(ISNA(VLOOKUP($A16,Extract!$AU$4:$BA$42,2,0)),\"\",VLOOKUP($A16,Extract!$AU$4:$BA$42,5,0))","v":-38.5},{"$f":"IF(ISNA(VLOOKUP($A16,Extract!$AU$4:$BA$42,2,0)),\"\",VLOOKUP($A16,Extract!$AU$4:$BA$42,6,0))","v":""},{"$f":"IF(ISNA(VLOOKUP($A16,Extract!$AU$4:$BA$42,2,0)),\"\",VLOOKUP($A16,Extract!$AU$4:$BA$42,7,0))","v":-17.3765}]
[14,{"$f":"IF(ISNA(VLOOKUP($A17,Extract!$AC$4:$AJ$42,2,0)),\"\",VLOOKUP(VLOOKUP($A17,Extract!$AC$4:$AJ$42,2,0),Players!$A$2:$B$91,2))","v":""},{"$f":"IF(ISNA(VLOOKUP($A17,Extract!$AC$4:$AJ$42,2,0)),\"\",VLOOKUP($A17,Extract!$AC$4:$AJ$42,3,0))","v":""},{"$f":"IF(ISNA(VLOOKUP($A17,Extract!$AC$4:$AJ$42,2,0)),\"\",VLOOKUP($A17,Extract!$AC$4:$AJ$42,4,0))","v":""},{"$f":"IF(ISNA(VLOOKUP($A17,Extract!$AC$4:$AJ$42,2,0)),\"\",VLOOKUP($A17,Extract!$AC$4:$AJ$42,5,0))","v":""},{"$f":"IF(ISNA(VLOOKUP($A17,Extract!$AC$4:$AJ$42,2,0)),\"\",VLOOKUP($A17,Extract!$AC$4:$AJ$42,6,0))","v":""},{"$f":"IF(ISNA(VLOOKUP($A17,Extract!$AC$4:$AJ$42,2,0)),\"\",VLOOKUP($A17,Extract!$AC$4:$AJ$42,7,0))","v":""},null,{"$f":"IF(ISNA(VLOOKUP($A17,Extract!$AL$4:$AS$40,2,0)),\"\",VLOOKUP(VLOOKUP($A17,Extract!$AL$4:$AS$40,2,0),Players!$A$2:$B$95,2))","v":""},{"$f":"IF(ISNA(VLOOKUP($A17,Extract!$AL$4:$AS$42,2,0)),\"\",VLOOKUP($A17,Extract!$AL$4:$AS$42,3,0))","v":""},{"$f":"IF(ISNA(VLOOKUP($A17,Extract!$AL$4:$AS$42,2,0)),\"\",VLOOKUP($A17,Extract!$AL$4:$AS$42,4,0))","v":""},{"$f":"IF(ISNA(VLOOKUP($A17,Extract!$AL$4:$AS$42,2,0)),\"\",VLOOKUP($A17,Extract!$AL$4:$AS$42,5,0))","v":""},{"$f":"IF(ISNA(VLOOKUP($A17,Extract!$AL$4:$AS$42,2,0)),\"\",VLOOKUP($A17,Extract!$AL$4:$AS$42,6,0))","v":""},{"$f":"IF(ISNA(VLOOKUP($A17,Extract!$AL$4:$AS$42,2,0)),\"\",VLOOKUP($A17,Extract!$AL$4:$AS$42,7,0))","v":""},null,{"$f":"IF(ISNA(VLOOKUP($A17,Extract!$AU$4:$BB$40,2,0)),\"\",VLOOKUP(VLOOKUP($A17,Extract!$AU$4:$BB$40,2,0),Players!$A$2:$B$95,2))","v":"Lesley Harrison"},{"$f":"IF(ISNA(VLOOKUP($A17,Extract!$AU$4:$BA$42,2,0)),\"\",VLOOKUP($A17,Extract!$AU$4:$BA$42,3,0))","v":"3M"},{"$f":"IF(ISNA(VLOOKUP($A17,Extract!$AU$4:$BA$42,2,0)),\"\",VLOOKUP($A17,Extract!$AU$4:$BA$42,4,0))","v":-24.333333333333332},{"$f":"IF(ISNA(VLOOKUP($A17,Extract!$AU$4:$BA$42,2,0)),\"\",VLOOKUP($A17,Extract!$AU$4:$BA$42,5,0))","v":""},{"$f":"IF(ISNA(VLOOKUP($A17,Extract!$AU$4:$BA$42,2,0)),\"\",VLOOKUP($A17,Extract!$AU$4:$BA$42,6,0))","v":""},{"$f":"IF(ISNA(VLOOKUP($A17,Extract!$AU$4:$BA$42,2,0)),\"\",VLOOKUP($A17,Extract!$AU$4:$BA$42,7,0))","v":-24.333333333333332}]
[15,{"$f":"IF(ISNA(VLOOKUP($A18,Extract!$AC$4:$AJ$42,2,0)),\"\",VLOOKUP(VLOOKUP($A18,Extract!$AC$4:$AJ$42,2,0),Players!$A$2:$B$91,2))","v":""},{"$f":"IF(ISNA(VLOOKUP($A18,Extract!$AC$4:$AJ$42,2,0)),\"\",VLOOKUP($A18,Extract!$AC$4:$AJ$42,3,0))","v":""},{"$f":"IF(ISNA(VLOOKUP($A18,Extract!$AC$4:$AJ$42,2,0)),\"\",VLOOKUP($A18,Extract!$AC$4:$AJ$42,4,0))","v":""},{"$f":"IF(ISNA(VLOOKUP($A18,Extract!$AC$4:$AJ$42,2,0)),\"\",VLOOKUP($A18,Extract!$AC$4:$AJ$42,5,0))","v":""},{"$f":"IF(ISNA(VLOOKUP($A18,Extract!$AC$4:$AJ$42,2,0)),\"\",VLOOKUP($A18,Extract!$AC$4:$AJ$42,6,0))","v":""},{"$f":"IF(ISNA(VLOOKUP($A18,Extract!$AC$4:$AJ$42,2,0)),\"\",VLOOKUP($A18,Extract!$AC$4:$AJ$42,7,0))","v":""},null,{"$f":"IF(ISNA(VLOOKUP($A18,Extract!$AL$4:$AS$40,2,0)),\"\",VLOOKUP(VLOOKUP($A18,Extract!$AL$4:$AS$40,2,0),Players!$A$2:$B$95,2))","v":""},{"$f":"IF(ISNA(VLOOKUP($A18,Extract!$AL$4:$AS$42,2,0)),\"\",VLOOKUP($A18,Extract!$AL$4:$AS$42,3,0))","v":""},{"$f":"IF(ISNA(VLOOKUP($A18,Extract!$AL$4:$AS$42,2,0)),\"\",VLOOKUP($A18,Extract!$AL$4:$AS$42,4,0))","v":""},{"$f":"IF(ISNA(VLOOKUP($A18,Extract!$AL$4:$AS$42,2,0)),\"\",VLOOKUP($A18,Extract!$AL$4:$AS$42,5,0))","v":""},{"$f":"IF(ISNA(VLOOKUP($A18,Extract!$AL$4:$AS$42,2,0)),\"\",VLOOKUP($A18,Extract!$AL$4:$AS$42,6,0))","v":""},{"$f":"IF(ISNA(VLOOKUP($A18,Extract!$AL$4:$AS$42,2,0)),\"\",VLOOKUP($A18,Extract!$AL$4:$AS$42,7,0))","v":""},null,{"$f":"IF(ISNA(VLOOKUP($A18,Extract!$AU$4:$BB$40,2,0)),\"\",VLOOKUP(VLOOKUP($A18,Extract!$AU$4:$BB$40,2,0),Players!$A$2:$B$95,2))","v":"Ashok Kwatra"},{"$f":"IF(ISNA(VLOOKUP($A18,Extract!$AU$4:$BA$42,2,0)),\"\",VLOOKUP($A18,Extract!$AU$4:$BA$42,3,0))","v":"3M"},{"$f":"IF(ISNA(VLOOKUP($A18,Extract!$AU$4:$BA$42,2,0)),\"\",VLOOKUP($A18,Extract!$AU$4:$BA$42,4,0))","v":-24.333333333333332},{"$f":"IF(ISNA(VLOOKUP($A18,Extract!$AU$4:$BA$42,2,0)),\"\",VLOOKUP($A18,Extract!$AU$4:$BA$42,5,0))","v":""},{"$f":"IF(ISNA(VLOOKUP($A18,Extract!$AU$4:$BA$42,2,0)),\"\",VLOOKUP($A18,Extract!$AU$4:$BA$42,6,0))","v":""},{"$f":"IF(ISNA(VLOOKUP($A18,Extract!$AU$4:$BA$42,2,0)),\"\",VLOOKUP($A18,Extract!$AU$4:$BA$42,7,0))","v":-24.333333333333332}]
[16,{"$f":"IF(ISNA(VLOOKUP($A19,Extract!$AC$4:$AJ$42,2,0)),\"\",VLOOKUP(VLOOKUP($A19,Extract!$AC$4:$AJ$42,2,0),Players!$A$2:$B$91,2))","v":""},{"$f":"IF(ISNA(VLOOKUP($A19,Extract!$AC$4:$AJ$42,2,0)),\"\",VLOOKUP($A19,Extract!$AC$4:$AJ$42,3,0))","v":""},{"$f":"IF(ISNA(VLOOKUP($A19,Extract!$AC$4:$AJ$42,2,0)),\"\",VLOOKUP($A19,Extract!$AC$4:$AJ$42,4,0))","v":""},{"$f":"IF(ISNA(VLOOKUP($A19,Extract!$AC$4:$AJ$42,2,0)),\"\",VLOOKUP($A19,Extract!$AC$4:$AJ$42,5,0))","v":""},{"$f":"IF(ISNA(VLOOKUP($A19,Extract!$AC$4:$AJ$42,2,0)),\"\",VLOOKUP($A19,Extract!$AC$4:$AJ$42,6,0))","v":""},{"$f":"IF(ISNA(VLOOKUP($A19,Extract!$AC$4:$AJ$42,2,0)),\"\",VLOOKUP($A19,Extract!$AC$4:$AJ$42,7,0))","v":""},null,{"$f":"IF(ISNA(VLOOKUP($A19,Extract!$AL$4:$AS$40,2,0)),\"\",VLOOKUP(VLOOKUP($A19,Extract!$AL$4:$AS$40,2,0),Players!$A$2:$B$95,2))","v":""},{"$f":"IF(ISNA(VLOOKUP($A19,Extract!$AL$4:$AS$42,2,0)),\"\",VLOOKUP($A19,Extract!$AL$4:$AS$42,3,0))","v":""},{"$f":"IF(ISNA(VLOOKUP($A19,Extract!$AL$4:$AS$42,2,0)),\"\",VLOOKUP($A19,Extract!$AL$4:$AS$42,4,0))","v":""},{"$f":"IF(ISNA(VLOOKUP($A19,Extract!$AL$4:$AS$42,2,0)),\"\",VLOOKUP($A19,Extract!$AL$4:$AS$42,5,0))","v":""},{"$f":"IF(ISNA(VLOOKUP($A19,Extract!$AL$4:$AS$42,2,0)),\"\",VLOOKUP($A19,Extract!$AL$4:$AS$42,6,0))","v":""},{"$f":"IF(ISNA(VLOOKUP($A19,Extract!$AL$4:$AS$42,2,0)),\"\",VLOOKUP($A19,Extract!$AL$4:$AS$42,7,0))","v":""},null,{"$f":"IF(ISNA(VLOOKUP($A19,Extract!$AU$4:$BB$40,2,0)),\"\",VLOOKUP(VLOOKUP($A19,Extract!$AU$4:$BB$40,2,0),Players!$A$2:$B$95,2))","v":"Mike Lewis"},{"$f":"IF(ISNA(VLOOKUP($A19,Extract!$AU$4:$BA$42,2,0)),\"\",VLOOKUP($A19,Extract!$AU$4:$BA$42,3,0))","v":"1M"},{"$f":"IF(ISNA(VLOOKUP($A19,Extract!$AU$4:$BA$42,2,0)),\"\",VLOOKUP($A19,Extract!$AU$4:$BA$42,4,0))","v":-26.5},{"$f":"IF(ISNA(VLOOKUP($A19,Extract!$AU$4:$BA$42,2,0)),\"\",VLOOKUP($A19,Extract!$AU$4:$BA$42,5,0))","v":""},{"$f":"IF(ISNA(VLOOKUP($A19,Extract!$AU$4:$BA$42,2,0)),\"\",VLOOKUP($A19,Extract!$AU$4:$BA$42,6,0))","v":""},{"$f":"IF(ISNA(VLOOKUP($A19,Extract!$AU$4:$BA$42,2,0)),\"\",VLOOKUP($A19,Extract!$AU$4:$BA$42,7,0))","v":-26.5}]
[17,{"$f":"IF(ISNA(VLOOKUP($A20,Extract!$AC$4:$AJ$42,2,0)),\"\",VLOOKUP(VLOOKUP($A20,Extract!$AC$4:$AJ$42,2,0),Players!$A$2:$B$91,2))","v":""},{"$f":"IF(ISNA(VLOOKUP($A20,Extract!$AC$4:$AJ$42,2,0)),\"\",VLOOKUP($A20,Extract!$AC$4:$AJ$42,3,0))","v":""},{"$f":"IF(ISNA(VLOOKUP($A20,Extract!$AC$4:$AJ$42,2,0)),\"\",VLOOKUP($A20,Extract!$AC$4:$AJ$42,4,0))","v":""},{"$f":"IF(ISNA(VLOOKUP($A20,Extract!$AC$4:$AJ$42,2,0)),\"\",VLOOKUP($A20,Extract!$AC$4:$AJ$42,5,0))","v":""},{"$f":"IF(ISNA(VLOOKUP($A20,Extract!$AC$4:$AJ$42,2,0)),\"\",VLOOKUP($A20,Extract!$AC$4:$AJ$42,6,0))","v":""},{"$f":"IF(ISNA(VLOOKUP($A20,Extract!$AC$4:$AJ$42,2,0)),\"\",VLOOKUP($A20,Extract!$AC$4:$AJ$42,7,0))","v":""},null,{"$f":"IF(ISNA(VLOOKUP($A20,Extract!$AL$4:$AS$40,2,0)),\"\",VLOOKUP(VLOOKUP($A20,Extract!$AL$4:$AS$40,2,0),Players!$A$2:$B$95,2))","v":""},{"$f":"IF(ISNA(VLOOKUP($A20,Extract!$AL$4:$AS$42,2,0)),\"\",VLOOKUP($A20,Extract!$AL$4:$AS$42,3,0))","v":""},{"$f":"IF(ISNA(VLOOKUP($A20,Extract!$AL$4:$AS$42,2,0)),\"\",VLOOKUP($A20,Extract!$AL$4:$AS$42,4,0))","v":""},{"$f":"IF(ISNA(VLOOKUP($A20,Extract!$AL$4:$AS$42,2,0)),\"\",VLOOKUP($A20,Extract!$AL$4:$AS$42,5,0))","v":""},{"$f":"IF(ISNA(VLOOKUP($A20,Extract!$AL$4:$AS$42,2,0)),\"\",VLOOKUP($A20,Extract!$AL$4:$AS$42,6,0))","v":""},{"$f":"IF(ISNA(VLOOKUP($A20,Extract!$AL$4:$AS$42,2,0)),\"\",VLOOKUP($A20,Extract!$AL$4:$AS$42,7,0))","v":""},null,{"$f":"IF(ISNA(VLOOKUP($A20,Extract!$AU$4:$BB$40,2,0)),\"\",VLOOKUP(VLOOKUP($A20,Extract!$AU$4:$BB$40,2,0),Players!$A$2:$B$95,2))","v":""},{"$f":"IF(ISNA(VLOOKUP($A20,Extract!$AU$4:$BA$42,2,0)),\"\",VLOOKUP($A20,Extract!$AU$4:$BA$42,3,0))","v":""},{"$f":"IF(ISNA(VLOOKUP($A20,Extract!$AU$4:$BA$42,2,0)),\"\",VLOOKUP($A20,Extract!$AU$4:$BA$42,4,0))","v":""},{"$f":"IF(ISNA(VLOOKUP($A20,Extract!$AU$4:$BA$42,2,0)),\"\",VLOOKUP($A20,Extract!$AU$4:$BA$42,5,0))","v":""},{"$f":"IF(ISNA(VLOOKUP($A20,Extract!$AU$4:$BA$42,2,0)),\"\",VLOOKUP($A20,Extract!$AU$4:$BA$42,6,0))","v":""},{"$f":"IF(ISNA(VLOOKUP($A20,Extract!$AU$4:$BA$42,2,0)),\"\",VLOOKUP($A20,Extract!$AU$4:$BA$42,7,0))","v":""}]
[18,{"$f":"IF(ISNA(VLOOKUP($A21,Extract!$AC$4:$AJ$42,2,0)),\"\",VLOOKUP(VLOOKUP($A21,Extract!$AC$4:$AJ$42,2,0),Players!$A$2:$B$91,2))","v":""},{"$f":"IF(ISNA(VLOOKUP($A21,Extract!$AC$4:$AJ$42,2,0)),\"\",VLOOKUP($A21,Extract!$AC$4:$AJ$42,3,0))","v":""},{"$f":"IF(ISNA(VLOOKUP($A21,Extract!$AC$4:$AJ$42,2,0)),\"\",VLOOKUP($A21,Extract!$AC$4:$AJ$42,4,0))","v":""},{"$f":"IF(ISNA(VLOOKUP($A21,Extract!$AC$4:$AJ$42,2,0)),\"\",VLOOKUP($A21,Extract!$AC$4:$AJ$42,5,0))","v":""},{"$f":"IF(ISNA(VLOOKUP($A21,Extract!$AC$4:$AJ$42,2,0)),\"\",VLOOKUP($A21,Extract!$AC$4:$AJ$42,6,0))","v":""},{"$f":"IF(ISNA(VLOOKUP($A21,Extract!$AC$4:$AJ$42,2,0)),\"\",VLOOKUP($A21,Extract!$AC$4:$AJ$42,7,0))","v":""},null,{"$f":"IF(ISNA(VLOOKUP($A21,Extract!$AL$4:$AS$40,2,0)),\"\",VLOOKUP(VLOOKUP($A21,Extract!$AL$4:$AS$40,2,0),Players!$A$2:$B$95,2))","v":""},{"$f":"IF(ISNA(VLOOKUP($A21,Extract!$AL$4:$AS$42,2,0)),\"\",VLOOKUP($A21,Extract!$AL$4:$AS$42,3,0))","v":""},{"$f":"IF(ISNA(VLOOKUP($A21,Extract!$AL$4:$AS$42,2,0)),\"\",VLOOKUP($A21,Extract!$AL$4:$AS$42,4,0))","v":""},{"$f":"IF(ISNA(VLOOKUP($A21,Extract!$AL$4:$AS$42,2,0)),\"\",VLOOKUP($A21,Extract!$AL$4:$AS$42,5,0))","v":""},{"$f":"IF(ISNA(VLOOKUP($A21,Extract!$AL$4:$AS$42,2,0)),\"\",VLOOKUP($A21,Extract!$AL$4:$AS$42,6,0))","v":""},{"$f":"IF(ISNA(VLOOKUP($A21,Extract!$AL$4:$AS$42,2,0)),\"\",VLOOKUP($A21,Extract!$AL$4:$AS$42,7,0))","v":""},null,{"$f":"IF(ISNA(VLOOKUP($A21,Extract!$AU$4:$BB$40,2,0)),\"\",VLOOKUP(VLOOKUP($A21,Extract!$AU$4:$BB$40,2,0),Players!$A$2:$B$95,2))","v":""},{"$f":"IF(ISNA(VLOOKUP($A21,Extract!$AU$4:$BA$42,2,0)),\"\",VLOOKUP($A21,Extract!$AU$4:$BA$42,3,0))","v":""},{"$f":"IF(ISNA(VLOOKUP($A21,Extract!$AU$4:$BA$42,2,0)),\"\",VLOOKUP($A21,Extract!$AU$4:$BA$42,4,0))","v":""},{"$f":"IF(ISNA(VLOOKUP($A21,Extract!$AU$4:$BA$42,2,0)),\"\",VLOOKUP($A21,Extract!$AU$4:$BA$42,5,0))","v":""},{"$f":"IF(ISNA(VLOOKUP($A21,Extract!$AU$4:$BA$42,2,0)),\"\",VLOOKUP($A21,Extract!$AU$4:$BA$42,6,0))","v":""},{"$f":"IF(ISNA(VLOOKUP($A21,Extract!$AU$4:$BA$42,2,0)),\"\",VLOOKUP($A21,Extract!$AU$4:$BA$42,7,0))","v":""}]
[19,{"$f":"IF(ISNA(VLOOKUP($A22,Extract!$AC$4:$AJ$42,2,0)),\"\",VLOOKUP(VLOOKUP($A22,Extract!$AC$4:$AJ$42,2,0),Players!$A$2:$B$91,2))","v":""},{"$f":"IF(ISNA(VLOOKUP($A22,Extract!$AC$4:$AJ$42,2,0)),\"\",VLOOKUP($A22,Extract!$AC$4:$AJ$42,3,0))","v":""},{"$f":"IF(ISNA(VLOOKUP($A22,Extract!$AC$4:$AJ$42,2,0)),\"\",VLOOKUP($A22,Extract!$AC$4:$AJ$42,4,0))","v":""},{"$f":"IF(ISNA(VLOOKUP($A22,Extract!$AC$4:$AJ$42,2,0)),\"\",VLOOKUP($A22,Extract!$AC$4:$AJ$42,5,0))","v":""},{"$f":"IF(ISNA(VLOOKUP($A22,Extract!$AC$4:$AJ$42,2,0)),\"\",VLOOKUP($A22,Extract!$AC$4:$AJ$42,6,0))","v":""},{"$f":"IF(ISNA(VLOOKUP($A22,Extract!$AC$4:$AJ$42,2,0)),\"\",VLOOKUP($A22,Extract!$AC$4:$AJ$42,7,0))","v":""},null,{"$f":"IF(ISNA(VLOOKUP($A22,Extract!$AL$4:$AS$40,2,0)),\"\",VLOOKUP(VLOOKUP($A22,Extract!$AL$4:$AS$40,2,0),Players!$A$2:$B$95,2))","v":""},{"$f":"IF(ISNA(VLOOKUP($A22,Extract!$AL$4:$AS$42,2,0)),\"\",VLOOKUP($A22,Extract!$AL$4:$AS$42,3,0))","v":""},{"$f":"IF(ISNA(VLOOKUP($A22,Extract!$AL$4:$AS$42,2,0)),\"\",VLOOKUP($A22,Extract!$AL$4:$AS$42,4,0))","v":""},{"$f":"IF(ISNA(VLOOKUP($A22,Extract!$AL$4:$AS$42,2,0)),\"\",VLOOKUP($A22,Extract!$AL$4:$AS$42,5,0))","v":""},{"$f":"IF(ISNA(VLOOKUP($A22,Extract!$AL$4:$AS$42,2,0)),\"\",VLOOKUP($A22,Extract!$AL$4:$AS$42,6,0))","v":""},{"$f":"IF(ISNA(VLOOKUP($A22,Extract!$AL$4:$AS$42,2,0)),\"\",VLOOKUP($A22,Extract!$AL$4:$AS$42,7,0))","v":""},null,{"$f":"IF(ISNA(VLOOKUP($A22,Extract!$AU$4:$BB$40,2,0)),\"\",VLOOKUP(VLOOKUP($A22,Extract!$AU$4:$BB$40,2,0),Players!$A$2:$B$95,2))","v":""},{"$f":"IF(ISNA(VLOOKUP($A22,Extract!$AU$4:$BA$42,2,0)),\"\",VLOOKUP($A22,Extract!$AU$4:$BA$42,3,0))","v":""},{"$f":"IF(ISNA(VLOOKUP($A22,Extract!$AU$4:$BA$42,2,0)),\"\",VLOOKUP($A22,Extract!$AU$4:$BA$42,4,0))","v":""},{"$f":"IF(ISNA(VLOOKUP($A22,Extract!$AU$4:$BA$42,2,0)),\"\",VLOOKUP($A22,Extract!$AU$4:$BA$42,5,0))","v":""},{"$f":"IF(ISNA(VLOOKUP($A22,Extract!$AU$4:$BA$42,2,0)),\"\",VLOOKUP($A22,Extract!$AU$4:$BA$42,6,0))","v":""},{"$f":"IF(ISNA(VLOOKUP($A22,Extract!$AU$4:$BA$42,2,0)),\"\",VLOOKUP($A22,Extract!$AU$4:$BA$42,7,0))","v":""}]
[20,{"$f":"IF(ISNA(VLOOKUP($A23,Extract!$AC$4:$AJ$42,2,0)),\"\",VLOOKUP(VLOOKUP($A23,Extract!$AC$4:$AJ$42,2,0),Players!$A$2:$B$91,2))","v":""},{"$f":"IF(ISNA(VLOOKUP($A23,Extract!$AC$4:$AJ$42,2,0)),\"\",VLOOKUP($A23,Extract!$AC$4:$AJ$42,3,0))","v":""},{"$f":"IF(ISNA(VLOOKUP($A23,Extract!$AC$4:$AJ$42,2,0)),\"\",VLOOKUP($A23,Extract!$AC$4:$AJ$42,4,0))","v":""},{"$f":"IF(ISNA(VLOOKUP($A23,Extract!$AC$4:$AJ$42,2,0)),\"\",VLOOKUP($A23,Extract!$AC$4:$AJ$42,5,0))","v":""},{"$f":"IF(ISNA(VLOOKUP($A23,Extract!$AC$4:$AJ$42,2,0)),\"\",VLOOKUP($A23,Extract!$AC$4:$AJ$42,6,0))","v":""},{"$f":"IF(ISNA(VLOOKUP($A23,Extract!$AC$4:$AJ$42,2,0)),\"\",VLOOKUP($A23,Extract!$AC$4:$AJ$42,7,0))","v":""},null,{"$f":"IF(ISNA(VLOOKUP($A23,Extract!$AL$4:$AS$40,2,0)),\"\",VLOOKUP(VLOOKUP($A23,Extract!$AL$4:$AS$40,2,0),Players!$A$2:$B$95,2))","v":""},{"$f":"IF(ISNA(VLOOKUP($A23,Extract!$AL$4:$AS$42,2,0)),\"\",VLOOKUP($A23,Extract!$AL$4:$AS$42,3,0))","v":""},{"$f":"IF(ISNA(VLOOKUP($A23,Extract!$AL$4:$AS$42,2,0)),\"\",VLOOKUP($A23,Extract!$AL$4:$AS$42,4,0))","v":""},{"$f":"IF(ISNA(VLOOKUP($A23,Extract!$AL$4:$AS$42,2,0)),\"\",VLOOKUP($A23,Extract!$AL$4:$AS$42,5,0))","v":""},{"$f":"IF(ISNA(VLOOKUP($A23,Extract!$AL$4:$AS$42,2,0)),\"\",VLOOKUP($A23,Extract!$AL$4:$AS$42,6,0))","v":""},{"$f":"IF(ISNA(VLOOKUP($A23,Extract!$AL$4:$AS$42,2,0)),\"\",VLOOKUP($A23,Extract!$AL$4:$AS$42,7,0))","v":""},null,{"$f":"IF(ISNA(VLOOKUP($A23,Extract!$AU$4:$BB$40,2,0)),\"\",VLOOKUP(VLOOKUP($A23,Extract!$AU$4:$BB$40,2,0),Players!$A$2:$B$95,2))","v":""},{"$f":"IF(ISNA(VLOOKUP($A23,Extract!$AU$4:$BA$42,2,0)),\"\",VLOOKUP($A23,Extract!$AU$4:$BA$42,3,0))","v":""},{"$f":"IF(ISNA(VLOOKUP($A23,Extract!$AU$4:$BA$42,2,0)),\"\",VLOOKUP($A23,Extract!$AU$4:$BA$42,4,0))","v":""},{"$f":"IF(ISNA(VLOOKUP($A23,Extract!$AU$4:$BA$42,2,0)),\"\",VLOOKUP($A23,Extract!$AU$4:$BA$42,5,0))","v":""},{"$f":"IF(ISNA(VLOOKUP($A23,Extract!$AU$4:$BA$42,2,0)),\"\",VLOOKUP($A23,Extract!$AU$4:$BA$42,6,0))","v":""},{"$f":"IF(ISNA(VLOOKUP($A23,Extract!$AU$4:$BA$42,2,0)),\"\",VLOOKUP($A23,Extract!$AU$4:$BA$42,7,0))","v":""}]
[21,{"$f":"IF(ISNA(VLOOKUP($A24,Extract!$AC$4:$AJ$42,2,0)),\"\",VLOOKUP(VLOOKUP($A24,Extract!$AC$4:$AJ$42,2,0),Players!$A$2:$B$91,2))","v":""},{"$f":"IF(ISNA(VLOOKUP($A24,Extract!$AC$4:$AJ$42,2,0)),\"\",VLOOKUP($A24,Extract!$AC$4:$AJ$42,3,0))","v":""},{"$f":"IF(ISNA(VLOOKUP($A24,Extract!$AC$4:$AJ$42,2,0)),\"\",VLOOKUP($A24,Extract!$AC$4:$AJ$42,4,0))","v":""},{"$f":"IF(ISNA(VLOOKUP($A24,Extract!$AC$4:$AJ$42,2,0)),\"\",VLOOKUP($A24,Extract!$AC$4:$AJ$42,5,0))","v":""},{"$f":"IF(ISNA(VLOOKUP($A24,Extract!$AC$4:$AJ$42,2,0)),\"\",VLOOKUP($A24,Extract!$AC$4:$AJ$42,6,0))","v":""},{"$f":"IF(ISNA(VLOOKUP($A24,Extract!$AC$4:$AJ$42,2,0)),\"\",VLOOKUP($A24,Extract!$AC$4:$AJ$42,7,0))","v":""},null,{"$f":"IF(ISNA(VLOOKUP($A24,Extract!$AL$4:$AS$40,2,0)),\"\",VLOOKUP(VLOOKUP($A24,Extract!$AL$4:$AS$40,2,0),Players!$A$2:$B$95,2))","v":""},{"$f":"IF(ISNA(VLOOKUP($A24,Extract!$AL$4:$AS$42,2,0)),\"\",VLOOKUP($A24,Extract!$AL$4:$AS$42,3,0))","v":""},{"$f":"IF(ISNA(VLOOKUP($A24,Extract!$AL$4:$AS$42,2,0)),\"\",VLOOKUP($A24,Extract!$AL$4:$AS$42,4,0))","v":""},{"$f":"IF(ISNA(VLOOKUP($A24,Extract!$AL$4:$AS$42,2,0)),\"\",VLOOKUP($A24,Extract!$AL$4:$AS$42,5,0))","v":""},{"$f":"IF(ISNA(VLOOKUP($A24,Extract!$AL$4:$AS$42,2,0)),\"\",VLOOKUP($A24,Extract!$AL$4:$AS$42,6,0))","v":""},{"$f":"IF(ISNA(VLOOKUP($A24,Extract!$AL$4:$AS$42,2,0)),\"\",VLOOKUP($A24,Extract!$AL$4:$AS$42,7,0))","v":""},null,{"$f":"IF(ISNA(VLOOKUP($A24,Extract!$AU$4:$BB$40,2,0)),\"\",VLOOKUP(VLOOKUP($A24,Extract!$AU$4:$BB$40,2,0),Players!$A$2:$B$95,2))","v":""},{"$f":"IF(ISNA(VLOOKUP($A24,Extract!$AU$4:$BA$42,2,0)),\"\",VLOOKUP($A24,Extract!$AU$4:$BA$42,3,0))","v":""},{"$f":"IF(ISNA(VLOOKUP($A24,Extract!$AU$4:$BA$42,2,0)),\"\",VLOOKUP($A24,Extract!$AU$4:$BA$42,4,0))","v":""},{"$f":"IF(ISNA(VLOOKUP($A24,Extract!$AU$4:$BA$42,2,0)),\"\",VLOOKUP($A24,Extract!$AU$4:$BA$42,5,0))","v":""},{"$f":"IF(ISNA(VLOOKUP($A24,Extract!$AU$4:$BA$42,2,0)),\"\",VLOOKUP($A24,Extract!$AU$4:$BA$42,6,0))","v":""},{"$f":"IF(ISNA(VLOOKUP($A24,Extract!$AU$4:$BA$42,2,0)),\"\",VLOOKUP($A24,Extract!$AU$4:$BA$42,7,0))","v":""}]
[]
[null,"Tables are ranked on the per match Relative Score for that Division"]

{"sheet":"Pivots","index":2,"n_rows":133,"n_cols":53,"rows_kept":133,"cut":false,"hidden":true,"merged":[[2,6,2,8],[0,3,0,5]]}
[null,"Match","(Multiple Items)","All From 18/19 Season (19/20)",null,null,"Use the filter to edit",null,null,null,"Match","(Multiple Items)"]
["PT2",null,null,null,null,null,"Put a description in the Y box",null,null,"PT3",null,null,null,null,null,null,null,null,"PT4",null,null,null,null,null,null,null,"PT5",null,null,null,null,null,"PT1",null,null,null,null,null,null,null,null,"PT6"]
[null,"Row Labels","Count of Match","Sum of Butler","Sum of Relative",null,"Current Season",null,null,null,"Row Labels","Sum of Relative","Count of Match","Sum of Butler",null,null,null,null,null,"Row Labels","Sum of Butler","Sum of MatchS","Name",null,null,null,null,"Row Labels","Average of Relative","Average of Butler",null,null,null,"Player1","RB",null,null,null,null,null,null,null,"Player1","RB",null,null,null,null,null,"Sum of Butler","Column Labels"]
[null,"AKA",3,-31,-73,null,null,null,null,null,"AKM",-21.5,1,-10,null,null,null,null,null,"AKA",-38,143,{"$f":"IF(T4=\"\",\"\",VLOOKUP(T4,Players!$A$2:$B$98,2))","v":"Ashok Kwatra"},null,null,null,null,"AKA",-10.535714285714286,-5.4285714285714288,null,null,null,null,null,null,null,null,null,null,null,null,null,null,null,null,null,null,null,"Row Labels",1,2,3]
[null,3,3,-31,-73,null,null,null,null,null,1,-21.5,1,-10,null,null,null,null,null,"AKM",14,96,{"$f":"IF(T5=\"\",\"\",VLOOKUP(T5,Players!$A$2:$B$98,2))","v":"Andrew Kambites"},null,null,null,null,"DS",15,18,null,null,null,null,null,"Values",null,null,null,null,null,null,null,"Values",null,null,null,null,null,1,-192,-74,4]
[null,"AKM",1,-10,-21.5,null,null,null,null,null,"APR",20,2,63,null,null,null,null,null,"APO",-33,-13,{"$f":"IF(T6=\"\",\"\",VLOOKUP(T6,Players!$A$2:$B$98,2))","v":"Andrea Powell"},null,null,null,null,"LH",-20.75,-14.8,null,null,null,"Row Labels","Player2","Average of Team","Sum of Butler","Sum of MatchS","Sum of Relative",null,null,null,"Row Labels","Count of Match","Sum of Butler","Sum of Relative",null,null,null,2,246,258,122]
[null,1,1,-10,-21.5,null,null,null,null,null,3,20,2,63,null,null,null,null,null,"APR",51,324,{"$f":"IF(T7=\"\",\"\",VLOOKUP(T7,Players!$A$2:$B$98,2))","v":"Alison Pritchard"},null,null,null,null,"AKM",-5,7,null,null,null,1,null,null,null,null,null,null,null,null,"AKM",1,-10,-21.5,null,null,null,3,84,84,6]
[null,"APR",4,56,-13,null,null,null,null,null,"AS",-111.63249999999999,4,-85.74,null,null,null,null,null,"AS",-70.739999999999995,237.57,{"$f":"IF(T8=\"\",\"\",VLOOKUP(T8,Players!$A$2:$B$98,2))","v":"Allan Sanis"},null,null,null,null,"RB",-21.5,-10,null,null,null,null,"GW",1,-52,-96,-28,null,null,null,"GW",13,78.72,-100.89749999999999,null,null,null,4,100,56,-28]
[null,3,4,56,-13,null,null,null,null,null,1,-38.5,1,-16,null,null,null,null,null,"AW",-64,46,{"$f":"IF(T9=\"\",\"\",VLOOKUP(T9,Players!$A$2:$B$98,2))","v":"Alan Wearmouth"},null,null,null,null,"RCM",11.5,24,null,null,null,3,null,null,null,null,null,null,null,null,"KST",2,3,-15,null,null,null,5,122,20,-26]
[null,"AS",6,-69.739999999999995,-125.38249999999999,null,null,null,null,null,3,-73.132499999999993,3,-69.739999999999995,null,null,null,null,null,"BR",165.36,217.14,{"$f":"IF(T10=\"\",\"\",VLOOKUP(T10,Players!$A$2:$B$98,2))","v":"Ben Ritacca"},null,null,null,null,"APO",-29.75,-33,null,null,null,null,"GW",1,-13,42,-23.5,null,null,null,null,null,null,null,null,null,null,6,152,242,262]
[null,1,1,-16,-38.5,null,null,null,null,null,"AW",-47.75,2,-37,null,null,null,null,null,"BY",21,79,{"$f":"IF(T11=\"\",\"\",VLOOKUP(T11,Players!$A$2:$B$98,2))","v":"Bryony Youngs"},null,null,null,null,"SP",-29.75,-33,null,null,null,5,null,null,null,null,null,null,null,null,null,null,null,null,null,null,null,7,142,-64,-70]
[null,3,5,-53.739999999999995,-86.882499999999993,null,null,null,null,null,1,-47.75,2,-37,null,null,null,null,null,"CRO",147.07,430.87,{"$f":"IF(T12=\"\",\"\",VLOOKUP(T12,Players!$A$2:$B$98,2))","v":"Claire Robinson"},null,null,null,null,"APR",-3.3333333333333335,5.666666666666667,null,null,null,null,"GW",1,37,61,21.75,null,null,null,null,null,null,null,null,null,null,11,-2,12,216]
[null,"AW",3,-64,-75.5,null,null,null,null,null,"BR",111.075,5,165.36,null,null,null,null,null,"DA",51,324,{"$f":"IF(T13=\"\",\"\",VLOOKUP(T13,Players!$A$2:$B$98,2))","v":"David Atthey"},null,null,null,null,"DA",-3.3333333333333335,5.666666666666667,null,null,null,6,null,null,null,null,null,null,null,null,null,null,null,null,null,null,null,12,199.73999999999998,17.820000000000004,-70.500000000000014]
[null,1,2,-37,-47.75,null,null,null,null,null,2,7.0749999999999993,2,19.36,null,null,null,null,null,"DN",-25,18,{"$f":"IF(T14=\"\",\"\",VLOOKUP(T14,Players!$A$2:$B$98,2))","v":"Diana Nettleton"},null,null,null,null,"AS",-14.459166666666667,-7.8599999999999994,null,null,null,null,"GW",1,16,76,-3,null,null,null,null,null,null,null,null,null,null,13,138,198,262]
[null,2,1,-27,-27.75,null,null,null,null,null,3,104,3,146,null,null,null,null,null,"DS",36,24,{"$f":"IF(T15=\"\",\"\",VLOOKUP(T15,Players!$A$2:$B$98,2))","v":"David Simons"},null,null,null,null,"GW",-38.5,-16,null,null,null,7,null,null,null,null,null,null,null,null,null,null,null,null,null,null,null,14,242,60,186]
[null,"BR",5,165.36,111.075,null,null,null,null,null,"CRO",56.25,1,104,null,null,null,null,null,"GW",79.72,981.47,{"$f":"IF(T16=\"\",\"\",VLOOKUP(T16,Players!$A$2:$B$98,2))","v":"Gary Watson"},null,null,null,null,"IC",10.5,13,null,null,null,null,"KST",1,-19,71,-36.75,null,null,null,null,null,null,null,null,null,null,15,114,114,22]
[null,2,2,19.36,7.0749999999999993,null,null,null,null,null,1,56.25,1,104,null,null,null,null,null,"IC",55,190,{"$f":"IF(T17=\"\",\"\",VLOOKUP(T17,Players!$A$2:$B$98,2))","v":"Ian Constable"},null,null,null,null,"JSI",-36.5,-12,null,null,null,11,null,null,null,null,null,null,null,null,null,null,null,null,null,null,null,16,24,6,-66]
[null,3,3,146,104,null,null,null,null,null,"DA",20,2,63,null,null,null,null,null,"JA",-47.55,-66.430000000000007,{"$f":"IF(T18=\"\",\"\",VLOOKUP(T18,Players!$A$2:$B$98,2))","v":"Ian Constable"},null,null,null,null,"JUS",-10.938749999999999,-9.2899999999999991,null,null,null,null,"GW",1,-11,-1,-10.75,null,null,null,null,null,null,null,null,null,null,21,382,134,128]
[null,"CRO",4,127.07,37.102500000000006,null,null,null,null,null,3,20,2,63,null,null,null,null,null,"JAN",74.08,975.51,{"$f":"IF(T19=\"\",\"\",VLOOKUP(T19,Players!$A$2:$B$98,2))","v":"Joe Angseesing"},null,null,null,null,"BY",0.41666666666666669,7,null,null,null,12,null,null,null,null,null,null,null,null,null,null,null,null,null,null,null,22,2,176,196]
[null,1,4,127.07,37.102500000000006,null,null,null,null,null,"GW",-46.72,4,45.18,null,null,null,null,null,"JAR",96,367,{"$f":"IF(T20=\"\",\"\",VLOOKUP(T20,Players!$A$2:$B$98,2))","v":"John Arblaster"},null,null,null,null,"DN",-14.75,-12.5,null,null,null,null,"GW",1,9.5399999999999991,99.86999999999999,-15.427499999999998,null,null,null,null,null,null,null,null,null,null,23,92,-130,176]
[null,"DA",4,56,-13,null,null,null,null,null,1,-46.72,4,45.18,null,null,null,null,null,"JAT",144.07,553.87,{"$f":"IF(T21=\"\",\"\",VLOOKUP(T21,Players!$A$2:$B$98,2))","v":"John Atthey"},null,null,null,null,"PD",30.75,46,null,null,null,13,null,null,null,null,null,null,null,null,null,null,null,null,null,null,null,24,-6,-64,-36]
[null,3,4,56,-13,null,null,null,null,null,"JAN",-47.769999999999996,5,56.629999999999995,null,null,null,null,null,"JC",99.43,330.05,{"$f":"IF(T22=\"\",\"\",VLOOKUP(T22,Players!$A$2:$B$98,2))","v":"John Councer"},null,null,null,null,"CRO",7.8705000000000016,29.413999999999998,null,null,null,null,"GW",1,26,69,8.75,null,null,null,null,null,null,null,null,null,null,25,180,-4,168]
[null,"GW",10,74.72,-106.64749999999999,null,null,null,null,null,1,-47.769999999999996,5,56.629999999999995,null,null,null,null,null,"JSI",77.86,583.48,{"$f":"IF(T23=\"\",\"\",VLOOKUP(T23,Players!$A$2:$B$98,2))","v":"Jim Simons"},null,null,null,null,"JAT",7.8705000000000016,29.413999999999998,null,null,null,14,null,null,null,null,null,null,null,null,null,null,null,null,null,null,null,26,179.2,102.28,-132.86000000000001]
[null,1,10,74.72,-106.64749999999999,null,null,null,null,null,"JAR",-29,3,30,null,null,null,null,null,"JUS",-55.739999999999995,39.569999999999993,{"$f":"IF(T24=\"\",\"\",VLOOKUP(T24,Players!$A$2:$B$98,2))","v":"Judy Sanis"},null,null,null,null,"DA",-3.3333333333333335,5.666666666666667,null,null,null,null,"GW",1,20,121,-10.25,null,null,null,null,null,null,null,null,null,null,27,0,0,0]
[null,"JAN",9,97.08,-71.297499999999999,null,null,null,null,null,2,-32,1,-10,null,null,null,null,null,"KAS",39.620000000000005,87.75,{"$f":"IF(T25=\"\",\"\",VLOOKUP(T25,Players!$A$2:$B$98,2))","v":"Anne Swannell"},null,null,null,null,"APR",-3.3333333333333335,5.666666666666667,null,null,null,15,null,null,null,null,null,null,null,null,null,null,null,null,null,null,null,31,0,0,0]
[null,1,8,67.63,-98.52,null,null,null,null,null,3,3,2,40,null,null,null,null,null,"KST",75.08,813.51,{"$f":"IF(T26=\"\",\"\",VLOOKUP(T26,Players!$A$2:$B$98,2))","v":"Keith Stanley"},null,null,null,null,"DN",-14.75,-12.5,null,null,null,null,"GW",1,2,57,-12.25,null,null,null,null,null,null,null,null,null,null,32,0,0,0]
[null,2,1,29.45,27.2225,null,null,null,null,null,"JAT",56.25,1,104,null,null,null,null,null,"LH",-49,108,{"$f":"IF(T27=\"\",\"\",VLOOKUP(T27,Players!$A$2:$B$98,2))","v":"Lesley Harrison"},null,null,null,null,"BY",-14.75,-12.5,null,null,null,16,null,null,null,null,null,null,null,null,null,null,null,null,null,null,null,33,0,0,0]
[null,"JAR",5,34,-50.5,null,null,null,null,null,1,56.25,1,104,null,null,null,null,null,"MB",48.45,300.57,{"$f":"IF(T28=\"\",\"\",VLOOKUP(T28,Players!$A$2:$B$98,2))","v":"Mel Barlow"},null,null,null,null,"DS",15,18,null,null,null,null,"GW",1,-17,12,-20,null,null,null,null,null,null,null,null,null,null,34,0,0,0]
[null,2,3,-6,-53.5,null,null,null,null,null,"JC",-3.8850000000000016,4,8.8999999999999986,null,null,null,null,null,"ML",-31,-18,{"$f":"IF(T29=\"\",\"\",VLOOKUP(T29,Players!$A$2:$B$98,2))","v":"Mike Lewis"},null,null,null,null,"AKA",15,18,null,null,null,21,null,null,null,null,null,null,null,null,null,null,null,null,null,null,null,35,0,0,0]
[null,3,2,40,3,null,null,null,null,null,2,-3.8850000000000016,4,8.8999999999999986,null,null,null,null,null,"MR",128.43,469.04999999999995,{"$f":"IF(T30=\"\",\"\",VLOOKUP(T30,Players!$A$2:$B$98,2))","v":"Mark Rogers"},null,null,null,null,"GW",-10.35296875,4.9824999999999999,null,null,null,null,"GW",1,31,191,-16.75,null,null,null,null,null,null,null,null,null,null,36,0,0,0]
[null,"JAT",4,127.07,37.102500000000006,null,null,null,null,null,"JSI",-32.022499999999994,7,13.120000000000001,null,null,null,null,null,"MW",152.34,595.04999999999995,{"$f":"IF(T31=\"\",\"\",VLOOKUP(T31,Players!$A$2:$B$98,2))","v":"Mike Wignall"},null,null,null,null,"AS",-38.5,-16,null,null,null,22,null,null,null,null,null,null,null,null,null,null,null,null,null,null,null,37,0,0,0]
[null,1,4,127.07,37.102500000000006,null,null,null,null,null,2,-4.75,2,-29,null,null,null,null,null,"PD",515.51,1099.47,{"$f":"IF(T32=\"\",\"\",VLOOKUP(T32,Players!$A$2:$B$98,2))","v":"Paul Denning"},null,null,null,null,"JAT",-33.75,-3,null,null,null,null,"KST",1,22,1,21.75,null,null,null,null,null,null,null,null,null,null,38,0,0,0]
[null,"JC",9,34.430000000000007,-26.832500000000003,null,null,null,null,null,3,-27.272499999999994,5,42.120000000000005,null,null,null,null,null,"PL",200.73,408.14,{"$f":"IF(T33=\"\",\"\",VLOOKUP(T33,Players!$A$2:$B$98,2))","v":"Paul Lilley"},null,null,null,null,"PSH",7.5,20,null,null,null,23,null,null,null,null,null,null,null,null,null,null,null,null,null,null,null,39,0,0,0]
[null,1,1,-7,-6.75,null,null,null,null,null,"JUS",-36.632499999999993,2,-57.739999999999995,null,null,null,null,null,"PPE",104,354,{"$f":"IF(T34=\"\",\"\",VLOOKUP(T34,Players!$A$2:$B$98,2))","v":"Pam Pearce"},null,null,null,null,"RB",-7.7613461538461532,6.0553846153846154,null,null,null,null,"AKM",1,-10,46,-21.5,null,null,null,null,null,null,null,null,null,null,40,0,0,0]
[null,2,8,41.430000000000007,-20.082500000000003,null,null,null,null,null,3,-36.632499999999993,2,-57.739999999999995,null,null,null,null,null,"PPH",115.89000000000001,561.04999999999995,{"$f":"IF(T35=\"\",\"\",VLOOKUP(T35,Players!$A$2:$B$98,2))","v":"Patrick Phair"},null,null,null,null,"IC",1.0714285714285714,7.8571428571428568,null,null,null,24,null,null,null,null,null,null,null,null,null,null,null,null,null,null,null,41,0,0,0]
[null,"JSI",12,75.860000000000014,4.4900000000000091,null,null,null,null,null,"KST",28.98,4,85.63,null,null,null,null,null,"PSH",506.54,958.47,{"$f":"IF(T36=\"\",\"\",VLOOKUP(T36,Players!$A$2:$B$98,2))","v":"Patrick Shields"},null,null,null,null,"AS",10.5,13,null,null,null,null,"GW",1,26,-3,26.75,null,null,null,null,null,null,null,null,null,null,42,0,0,0]
[null,2,7,33.74,31.762500000000003,null,null,null,null,null,1,28.98,4,85.63,null,null,null,null,null,"PSW",252.73000000000002,400.14,{"$f":"IF(T37=\"\",\"\",VLOOKUP(T37,Players!$A$2:$B$98,2))","v":"Peter Swales"},null,null,null,null,"VC",-0.5,7,null,null,null,26,null,null,null,null,null,null,null,null,null,null,null,null,null,null,null,43,0,0,0]
[null,3,5,42.120000000000005,-27.272499999999994,null,null,null,null,null,"MB",-59.942499999999995,4,-17.549999999999997,null,null,null,null,null,"PW",176.29000000000002,625.31999999999994,{"$f":"IF(T38=\"\",\"\",VLOOKUP(T38,Players!$A$2:$B$98,2))","v":"Peter Waggett"},null,null,null,null,"JAN",-13.061346153846156,5.6984615384615385,null,null,null,null,"GW",1,4.18,89.6,-18.22,null,null,null,null,null,null,null,null,null,null,44,0,0,0]
[null,"JUS",4,-41.739999999999995,-50.382499999999993,null,null,null,null,null,2,-32,1,-10,null,null,null,null,null,"RB",71.72,836.47,{"$f":"IF(T39=\"\",\"\",VLOOKUP(T39,Players!$A$2:$B$98,2))","v":"Richard Butland"},null,null,null,null,"KST",-11.329750000000001,7.2080000000000002,null,null,null,null,null,null,null,null,null,null,null,null,null,null,null,null,null,null,null,45,0,0,0]
[null,3,4,-41.739999999999995,-50.382499999999993,null,null,null,null,null,3,-27.942499999999995,3,-7.5499999999999972,null,null,null,null,null,"RCM",493.54,1092.47,{"$f":"IF(T40=\"\",\"\",VLOOKUP(T40,Players!$A$2:$B$98,2))","v":"Richard Chamberlain"},null,null,null,null,"RCM",-15.75,32,null,null,null,null,null,null,null,null,null,null,null,null,null,null,null,null,null,null,null,46,0,0,0]
[null,"KAS",2,14.620000000000001,-9.317499999999999,null,null,null,null,null,"ML",-26.5,1,-31,null,null,null,null,null,"RCO",37,322,{"$f":"IF(T41=\"\",\"\",VLOOKUP(T41,Players!$A$2:$B$98,2))","v":"Roy Collard"},null,null,null,null,"WA",-20.375,-15,null,null,null,null,null,null,null,null,null,null,null,null,null,null,null,null,null,null,null,47,0,0,0]
[null,3,2,14.620000000000001,-9.317499999999999,null,null,null,null,null,3,-26.5,1,-31,null,null,null,null,null,"RHA",177.10000000000002,487.89,{"$f":"IF(T42=\"\",\"\",VLOOKUP(T42,Players!$A$2:$B$98,2))","v":"Richard Harris"},null,null,null,null,"JAR",0.6071428571428571,13.714285714285714,null,null,null,null,null,null,null,null,null,null,null,null,null,null,null,null,null,null,null,48,0,0,0]
[null,"KST",8,126.08,5.4525000000000006,null,null,null,null,null,"MR",-62.885000000000005,5,-58.099999999999994,null,null,null,null,null,"RJ",131.29,485.32,{"$f":"IF(T43=\"\",\"\",VLOOKUP(T43,Players!$A$2:$B$98,2))","v":"Roger Jackson"},null,null,null,null,"MB",0.6071428571428571,13.714285714285714,null,null,null,null,null,null,null,null,null,null,null,null,null,null,null,null,null,null,null,49,0,0,0]
[null,1,7,96.63,-21.77,null,null,null,null,null,2,-62.885000000000005,5,-58.099999999999994,null,null,null,null,null,"RPL",420.51,981.47,{"$f":"IF(T44=\"\",\"\",VLOOKUP(T44,Players!$A$2:$B$98,2))","v":"Richard Plackett"},null,null,null,null,"JAT",0.93375000000000108,24.011666666666667,null,null,null,null,null,null,null,null,null,null,null,null,null,null,null,null,null,null,null,50,0,0,0]
[null,2,1,29.45,27.2225,null,null,null,null,null,"MW",47.365000000000002,5,112.15,null,null,null,null,null,"RS",160.84,363.75,{"$f":"IF(T45=\"\",\"\",VLOOKUP(T45,Players!$A$2:$B$98,2))","v":"Roger Schofield"},null,null,null,null,"CRO",7.8705000000000016,29.413999999999998,null,null,null,null,null,null,null,null,null,null,null,null,null,null,null,null,null,null,null,51,0,0,0]
[null,"LH",3,-31,-73,null,null,null,null,null,2,44.365000000000002,3,71.150000000000006,null,null,null,null,null,"RW",-18.38,66.75,{"$f":"IF(T46=\"\",\"\",VLOOKUP(T46,Players!$A$2:$B$98,2))","v":"Roger Williams"},null,null,null,null,"GW",-33.75,-3,null,null,null,null,null,null,null,null,null,null,null,null,null,null,null,null,null,null,null,"Grand Total",2198.94,1144.1000000000001,1318.6399999999999]
[null,3,3,-31,-73,null,null,null,null,null,3,3,2,41,null,null,null,null,null,"SP",-33,-13,{"$f":"IF(T47=\"\",\"\",VLOOKUP(T47,Players!$A$2:$B$98,2))","v":"Stan Powell"},null,null,null,null,"JC",1.409791666666667,8.2858333333333345]
[null,"MB",6,-13.549999999999997,-81.442499999999995,null,null,null,null,null,"PD",5.259999999999998,6,108.91,null,null,null,null,null,"TG",11.739999999999995,270.75,{"$f":"IF(T48=\"\",\"\",VLOOKUP(T48,Players!$A$2:$B$98,2))","v":"Tricia Gilham"},null,null,null,null,"MR",1.409791666666667,8.2858333333333345]
[null,2,3,-6,-53.5,null,null,null,null,null,1,5.259999999999998,6,108.91,null,null,null,null,null,"TH",-64,46,{"$f":"IF(T49=\"\",\"\",VLOOKUP(T49,Players!$A$2:$B$98,2))","v":"Tony Hill"},null,null,null,null,"JSI",-3.7783333333333329,4.3255555555555558]
[null,3,3,-7.5499999999999972,-27.942499999999995,null,null,null,null,null,"PL",27.945,5,32.730000000000004,null,null,null,null,null,"TL",160.84,363.75,{"$f":"IF(T50=\"\",\"\",VLOOKUP(T50,Players!$A$2:$B$98,2))","v":"Tony Letts"},null,null,null,null,"AS",-36.5,-12]
[null,"ML",1,-31,-26.5,null,null,null,null,null,2,27.945,5,32.730000000000004,null,null,null,null,null,"VC",67.12,262.57,{"$f":"IF(T51=\"\",\"\",VLOOKUP(T51,Players!$A$2:$B$98,2))","v":"Val Constable"},null,null,null,null,"PPH",-3.271590909090909,5.8854545454545448]
[null,3,1,-31,-26.5,null,null,null,null,null,"PPE",2.25,2,41,null,null,null,null,null,"WA",32.19,436.90999999999997,{"$f":"IF(T52=\"\",\"\",VLOOKUP(T52,Players!$A$2:$B$98,2))","v":"Wendy Angseesing"},null,null,null,null,"VC",0.74625000000000108,4.1866666666666674]
[null,"MR",10,-32.57,-85.832499999999996,null,null,null,null,null,2,2.25,2,41,null,null,null,null,null,null,null,null,{"$f":"IF(T53=\"\",\"\",VLOOKUP(T53,Players!$A$2:$B$98,2))","v":""},null,null,null,null,"JUS",-10.938749999999999,-9.2899999999999991]
[null,1,1,-7,-6.75,null,null,null,null,null,"PPH",47.365000000000002,4,96.15,null,null,null,null,null,null,null,null,{"$f":"IF(T54=\"\",\"\",VLOOKUP(T54,Players!$A$2:$B$98,2))","v":""},null,null,null,null,"AS",-10.938749999999999,-9.2899999999999991]
[null,2,9,-25.57,-79.08250000000001,null,null,null,null,null,2,44.365000000000002,3,71.150000000000006,null,null,null,null,null,null,null,null,{"$f":"IF(T55=\"\",\"\",VLOOKUP(T55,Players!$A$2:$B$98,2))","v":""},null,null,null,null,"KAS",3.5365000000000011,7.9240000000000013]
[null,"MW",9,91.34,-9.4224999999999994,null,null,null,null,null,3,3,1,25,null,null,null,null,null,null,null,null,{"$f":"IF(T56=\"\",\"\",VLOOKUP(T56,Players!$A$2:$B$98,2))","v":""},null,null,null,null,"PSW",26.25,27]
[null,2,7,50.34,-12.422499999999999,null,null,null,null,null,"PSH",80.48,4,124.88,null,null,null,null,null,null,null,null,{"$f":"IF(T57=\"\",\"\",VLOOKUP(T57,Players!$A$2:$B$98,2))","v":""},null,null,null,null,"RW",-2.1418749999999998,3.1550000000000002]
[null,3,2,41,3,null,null,null,null,null,1,80.48,4,124.88,null,null,null,null,null,null,null,null,{"$f":"IF(T58=\"\",\"\",VLOOKUP(T58,Players!$A$2:$B$98,2))","v":""},null,null,null,null,"KST",-10.691458333333335,6.2566666666666668]
[null,"PD",12,291.51,98.392499999999998,null,null,null,null,null,"PSW",27.945,5,32.730000000000004,null,null,null,null,null,null,null,null,{"$f":"IF(T59=\"\",\"\",VLOOKUP(T59,Players!$A$2:$B$98,2))","v":""},null,null,null,null,"JAN",-11.329750000000001,7.2080000000000002]
[null,1,12,291.51,98.392499999999998,null,null,null,null,null,2,27.945,5,32.730000000000004,null,null,null,null,null,null,null,null,{"$f":"IF(T60=\"\",\"\",VLOOKUP(T60,Players!$A$2:$B$98,2))","v":""},null,null,null,null,"RB",-7.5,1.5]
[null,"PL",9,200.73000000000002,98.694999999999993,null,null,null,null,null,"PW",-8.6525000000000034,6,53.739999999999995,null,null,null,null,null,null,null,null,{"$f":"IF(T61=\"\",\"\",VLOOKUP(T61,Players!$A$2:$B$98,2))","v":""},null,null,null,null,"LH",-10.857142857142858,-7]
[null,2,6,78.73,59.695,null,null,null,null,null,3,-8.6525000000000034,6,53.739999999999995,null,null,null,null,null,null,null,null,{"$f":"IF(T62=\"\",\"\",VLOOKUP(T62,Players!$A$2:$B$98,2))","v":""},null,null,null,null,"AKA",-20.75,-14.8]
[null,3,3,122,39,null,null,null,null,null,"RB",-7.9699999999999989,5,73.180000000000007,null,null,null,null,null,null,null,null,{"$f":"IF(T63=\"\",\"\",VLOOKUP(T63,Players!$A$2:$B$98,2))","v":""},null,null,null,null,"PSW",13.875,12.5]
[null,"PPE",6,80,17.25,null,null,null,null,null,1,-7.9699999999999989,5,73.180000000000007,null,null,null,null,null,null,null,null,{"$f":"IF(T64=\"\",\"\",VLOOKUP(T64,Players!$A$2:$B$98,2))","v":""},null,null,null,null,"MB",-3.3365624999999994,6.0562500000000004]
[null,2,6,80,17.25,null,null,null,null,null,"RCM",64.73,5,156.88,null,null,null,null,null,null,null,null,{"$f":"IF(T65=\"\",\"\",VLOOKUP(T65,Players!$A$2:$B$98,2))","v":""},null,null,null,null,"JAR",0.6071428571428571,13.714285714285714]
[null,"PPH",9,158.89000000000001,83.877499999999998,null,null,null,null,null,1,64.73,5,156.88,null,null,null,null,null,null,null,null,{"$f":"IF(T66=\"\",\"\",VLOOKUP(T66,Players!$A$2:$B$98,2))","v":""},null,null,null,null,"JA",-30.942499999999995,-47.55]
[null,2,8,133.89000000000001,80.877499999999998,null,null,null,null,null,"RCO",-56.75,3,-26,null,null,null,null,null,null,null,null,{"$f":"IF(T67=\"\",\"\",VLOOKUP(T67,Players!$A$2:$B$98,2))","v":""},null,null,null,null,"MR",0.74449999999999927,8.5620000000000012]
[null,3,1,25,3,null,null,null,null,null,2,-56.75,3,-26,null,null,null,null,null,null,null,null,{"$f":"IF(T68=\"\",\"\",VLOOKUP(T68,Players!$A$2:$B$98,2))","v":""},null,null,null,null,"JC",1.4097916666666663,8.2858333333333345]
[null,"PSH",10,292.53999999999996,158.67250000000001,null,null,null,null,null,"RHA",111.075,5,165.36,null,null,null,null,null,null,null,null,{"$f":"IF(T69=\"\",\"\",VLOOKUP(T69,Players!$A$2:$B$98,2))","v":""},null,null,null,null,"PW",26.625,48]
[null,1,10,292.53999999999996,158.67250000000001,null,null,null,null,null,2,7.0749999999999993,2,19.36,null,null,null,null,null,null,null,null,{"$f":"IF(T70=\"\",\"\",VLOOKUP(T70,Players!$A$2:$B$98,2))","v":""},null,null,null,null,"RCO",-59,-67]
[null,"PSW",9,200.73000000000002,98.694999999999993,null,null,null,null,null,3,104,3,146,null,null,null,null,null,null,null,null,{"$f":"IF(T71=\"\",\"\",VLOOKUP(T71,Players!$A$2:$B$98,2))","v":""},null,null,null,null,"MW",0.29812500000000036,12.695]
[null,2,6,78.73,59.695,null,null,null,null,null,"RJ",-8.6525000000000034,6,53.739999999999995,null,null,null,null,null,null,null,null,{"$f":"IF(T72=\"\",\"\",VLOOKUP(T72,Players!$A$2:$B$98,2))","v":""},null,null,null,null,"PPH",11.84125,24.037500000000001]
[null,3,3,122,39,null,null,null,null,null,3,-8.6525000000000034,6,53.739999999999995,null,null,null,null,null,null,null,null,{"$f":"IF(T73=\"\",\"\",VLOOKUP(T73,Players!$A$2:$B$98,2))","v":""},null,null,null,null,"PW",-7.5,-6]
[null,"PW",12,102.28999999999999,-3.2900000000000009,null,null,null,null,null,"RPL",5.259999999999998,6,108.91,null,null,null,null,null,null,null,null,{"$f":"IF(T74=\"\",\"\",VLOOKUP(T74,Players!$A$2:$B$98,2))","v":""},null,null,null,null,"WA",-5.183928571428571,8.8842857142857135]
[null,2,1,-6,-7.5,null,null,null,null,null,1,5.259999999999998,6,108.91,null,null,null,null,null,null,null,null,{"$f":"IF(T75=\"\",\"\",VLOOKUP(T75,Players!$A$2:$B$98,2))","v":""},null,null,null,null,"PD",12.665394736842105,27.132105263157893]
[null,3,11,108.28999999999999,4.2099999999999991,null,null,null,null,null,"RS",18,4,40,null,null,null,null,null,null,null,null,{"$f":"IF(T76=\"\",\"\",VLOOKUP(T76,Players!$A$2:$B$98,2))","v":""},null,null,null,null,"BY",30.75,46]
[null,"RB",11,102.72,-67.897499999999994,null,null,null,null,null,2,18,4,40,null,null,null,null,null,null,null,null,{"$f":"IF(T77=\"\",\"\",VLOOKUP(T77,Players!$A$2:$B$98,2))","v":""},null,null,null,null,"PSH",34.75,49]
[null,1,11,102.72,-67.897499999999994,null,null,null,null,null,"RW",-26.5,1,-31,null,null,null,null,null,null,null,null,{"$f":"IF(T78=\"\",\"\",VLOOKUP(T78,Players!$A$2:$B$98,2))","v":""},null,null,null,null,"RPL",10.302499999999998,24.735882352941175]
[null,"RCM",10,275.54000000000002,108.17250000000001,null,null,null,null,null,3,-26.5,1,-31,null,null,null,null,null,null,null,null,{"$f":"IF(T79=\"\",\"\",VLOOKUP(T79,Players!$A$2:$B$98,2))","v":""},null,null,null,null,"PPE",1.55,10.4]
[null,1,10,275.54000000000002,108.17250000000001,null,null,null,null,null,"TL",18,4,40,null,null,null,null,null,null,null,null,{"$f":"IF(T80=\"\",\"\",VLOOKUP(T80,Players!$A$2:$B$98,2))","v":""},null,null,null,null,"RCO",1.55,10.4]
[null,"RCO",7,13,-41.75,null,null,null,null,null,2,18,4,40,null,null,null,null,null,null,null,null,{"$f":"IF(T81=\"\",\"\",VLOOKUP(T81,Players!$A$2:$B$98,2))","v":""},null,null,null,null,"PPH",-1.5232812499999997,7.2431250000000009]
[null,2,7,13,-41.75,null,null,null,null,null,"VC",4.4775000000000063,6,25.120000000000005,null,null,null,null,null,null,null,null,{"$f":"IF(T82=\"\",\"\",VLOOKUP(T82,Players!$A$2:$B$98,2))","v":""},null,null,null,null,"JSI",-3.271590909090909,5.8854545454545466]
[null,"RHA",9,202.10000000000002,138.6275,null,null,null,null,null,2,-4.75,2,-29,null,null,null,null,null,null,null,null,{"$f":"IF(T83=\"\",\"\",VLOOKUP(T83,Players!$A$2:$B$98,2))","v":""},null,null,null,null,"MW",11.84125,24.037500000000001]
[null,2,4,57.36,18.824999999999999,null,null,null,null,null,3,9.2275000000000063,4,54.120000000000005,null,null,null,null,null,null,null,null,{"$f":"IF(T84=\"\",\"\",VLOOKUP(T84,Players!$A$2:$B$98,2))","v":""},null,null,null,null,"PW",-35.75,-45]
[null,3,5,144.74,119.80250000000001,null,null,null,null,null,"WA",-39.25,2,-23,null,null,null,null,null,null,null,null,null,null,null,null,null,"PSH",16.682656250000001,31.658750000000001]
[null,"RJ",11,108.29,4.210000000000008,null,null,null,null,null,1,-39.25,1,-39,null,null,null,null,null,null,null,null,null,null,null,null,null,"GW",7.5,20]
[null,3,11,108.29,4.210000000000008,null,null,null,null,null,3,0,1,16,null,null,null,null,null,null,null,null,null,null,null,null,null,"PD",34.75,49]
[null,"RPL",11,242.51,63.642499999999998,null,null,null,null,null,"Grand Total",78.692500000000052,141,1627.17,null,null,null,null,null,null,null,null,null,null,null,null,null,"RCM",16.048035714285714,31.252857142857145]
[null,1,11,242.51,63.642499999999998,null,null,null,null,null,null,null,null,null,null,null,null,null,null,null,null,null,null,null,null,null,null,"PSW",12.724583333333333,21.060833333333331]
[null,"RS",9,146.84,79.402500000000003,null,null,null,null,null,null,null,null,null,null,null,null,null,null,null,null,null,null,null,null,null,null,"KAS",26.25,27]
[null,2,4,40,18,null,null,null,null,null,null,null,null,null,null,null,null,null,null,null,null,null,null,null,null,null,null,"LH",13.875,12.5]
[null,3,5,106.84,61.402500000000003,null,null,null,null,null,null,null,null,null,null,null,null,null,null,null,null,null,null,null,null,null,null,"PL",10.966111111111111,22.303333333333335]
[null,"RW",3,-16.38,-35.817499999999995,null,null,null,null,null,null,null,null,null,null,null,null,null,null,null,null,null,null,null,null,null,null,"PW",1.0505263157894738,9.2784210526315807]
[null,3,3,-16.38,-35.817499999999995,null,null,null,null,null,null,null,null,null,null,null,null,null,null,null,null,null,null,null,null,null,null,"MR",26.625,48]
[null,"TG",4,36.74,27.552500000000002,null,null,null,null,null,null,null,null,null,null,null,null,null,null,null,null,null,null,null,null,null,null,"MW",-7.5,-6]
[null,2,2,38,11.75,null,null,null,null,null,null,null,null,null,null,null,null,null,null,null,null,null,null,null,null,null,null,"PPH",-35.75,-45]
[null,3,2,-1.26,15.802500000000002,null,null,null,null,null,null,null,null,null,null,null,null,null,null,null,null,null,null,null,null,null,null,"RJ",0.66400000000000003,8.7526666666666681]
[null,"TH",3,-64,-75.5,null,null,null,null,null,null,null,null,null,null,null,null,null,null,null,null,null,null,null,null,null,null,"RB",-8.5873437499999987,4.4824999999999999]
[null,1,2,-37,-47.75,null,null,null,null,null,null,null,null,null,null,null,null,null,null,null,null,null,null,null,null,null,null,"AKM",-21.5,-10]
[null,2,1,-27,-27.75,null,null,null,null,null,null,null,null,null,null,null,null,null,null,null,null,null,null,null,null,null,null,"GW",-7.7613461538461532,6.0553846153846154]
[null,"TL",9,146.84,79.402500000000003,null,null,null,null,null,null,null,null,null,null,null,null,null,null,null,null,null,null,null,null,null,null,"KST",-7.5,1.5]
[null,2,4,40,18,null,null,null,null,null,null,null,null,null,null,null,null,null,null,null,null,null,null,null,null,null,null,"RCM",13.776406250000001,30.846249999999998]
[null,3,5,106.84,61.402500000000003,null,null,null,null,null,null,null,null,null,null,null,null,null,null,null,null,null,null,null,null,null,null,"JAN",-15.75,32]
[null,"VC",6,25.12,4.4775000000000063,null,null,null,null,null,null,null,null,null,null,null,null,null,null,null,null,null,null,null,null,null,null,"AKM",11.5,24]
[null,2,2,-29,-4.75,null,null,null,null,null,null,null,null,null,null,null,null,null,null,null,null,null,null,null,null,null,null,"PSH",16.048035714285714,31.252857142857145]
[null,3,4,54.120000000000005,9.2275000000000063,null,null,null,null,null,null,null,null,null,null,null,null,null,null,null,null,null,null,null,null,null,null,"RCO",-3.9545454545454546,3.3636363636363638]
[null,"WA",5,-37.81,-88.537499999999994,null,null,null,null,null,null,null,null,null,null,null,null,null,null,null,null,null,null,null,null,null,null,"MR",-59,-67]
[null,1,1,-39,-39.25,null,null,null,null,null,null,null,null,null,null,null,null,null,null,null,null,null,null,null,null,null,null,"PPE",1.55,10.4]
[null,2,3,-14.809999999999999,-49.287499999999994,null,null,null,null,null,null,null,null,null,null,null,null,null,null,null,null,null,null,null,null,null,null,"RHA",3.6751666666666667,11.806666666666667]
[null,3,1,16,0,null,null,null,null,null,null,null,null,null,null,null,null,null,null,null,null,null,null,null,null,null,null,"TG",-5.5947499999999994,1.1740000000000002]
[null,"(blank)",264,null,0,null,null,null,null,null,null,null,null,null,null,null,null,null,null,null,null,null,null,null,null,null,null,"BR",22.215,33.072000000000003]
[null,1,88,null,0,null,null,null,null,null,null,null,null,null,null,null,null,null,null,null,null,null,null,null,null,null,null,"RJ",0.66399999999999992,8.7526666666666664]
[null,2,88,null,0,null,null,null,null,null,null,null,null,null,null,null,null,null,null,null,null,null,null,null,null,null,null,"PW",0.66399999999999992,8.7526666666666664]
[null,3,88,null,0,null,null,null,null,null,null,null,null,null,null,null,null,null,null,null,null,null,null,null,null,null,null,"RPL",10.302499999999998,24.735882352941175]
[null,"(blank)",null,null,null,null,null,null,null,null,null,null,null,null,null,null,null,null,null,null,null,null,null,null,null,null,null,"PD",10.302499999999998,24.735882352941175]
[null,"Grand Total",551,3263.2299999999996,30.942500000000191,null,null,null,null,null,null,null,null,null,null,null,null,null,null,null,null,null,null,null,null,null,null,"RS",6.3547727272727279,14.621818181818183]
[null,null,null,null,null,null,null,null,null,null,null,null,null,null,null,null,null,null,null,null,null,null,null,null,null,null,null,"TL",6.3547727272727279,14.621818181818183]
[null,null,null,null,null,null,null,null,null,null,null,null,null,null,null,null,null,null,null,null,null,null,null,null,null,null,null,"RW",-7.0134999999999987,-3.6759999999999997]
[null,null,null,null,null,null,null,null,null,null,null,null,null,null,null,null,null,null,null,null,null,null,null,null,null,null,null,"KAS",-2.1418749999999998,3.1550000000000002]
[null,null,null,null,null,null,null,null,null,null,null,null,null,null,null,null,null,null,null,null,null,null,null,null,null,null,null,"ML",-26.5,-31]
[null,null,null,null,null,null,null,null,null,null,null,null,null,null,null,null,null,null,null,null,null,null,null,null,null,null,null,"SP",-29.75,-33]
[null,null,null,null,null,null,null,null,null,null,null,null,null,null,null,null,null,null,null,null,null,null,null,null,null,null,null,"APO",-29.75,-33]
[null,null,null,null,null,null,null,null,null,null,null,null,null,null,null,null,null,null,null,null,null,null,null,null,null,null,null,"TG",-5.5947499999999994,1.1739999999999995]
[null,null,null,null,null,null,null,null,null,null,null,null,null,null,null,null,null,null,null,null,null,null,null,null,null,null,null,"RHA",-5.5947499999999994,1.1739999999999995]
[null,null,null,null,null,null,null,null,null,null,null,null,null,null,null,null,null,null,null,null,null,null,null,null,null,null,null,"TL",6.3547727272727279,14.621818181818183]
[null,null,null,null,null,null,null,null,null,null,null,null,null,null,null,null,null,null,null,null,null,null,null,null,null,null,null,"RS",6.3547727272727279,14.621818181818183]
[null,null,null,null,null,null,null,null,null,null,null,null,null,null,null,null,null,null,null,null,null,null,null,null,null,null,null,"VC",0.12312500000000053,5.5933333333333337]
[null,null,null,null,null,null,null,null,null,null,null,null,null,null,null,null,null,null,null,null,null,null,null,null,null,null,null,"IC",-0.5,7]
[null,null,null,null,null,null,null,null,null,null,null,null,null,null,null,null,null,null,null,null,null,null,null,null,null,null,null,"JSI",0.74625000000000108,4.1866666666666674]
[null,null,null,null,null,null,null,null,null,null,null,null,null,null,null,null,null,null,null,null,null,null,null,null,null,null,null,"WA",-8.5597222222222218,3.5766666666666662]
[null,null,null,null,null,null,null,null,null,null,null,null,null,null,null,null,null,null,null,null,null,null,null,null,null,null,null,"JAN",-20.375,-15]
[null,null,null,null,null,null,null,null,null,null,null,null,null,null,null,null,null,null,null,null,null,null,null,null,null,null,null,"MW",-5.183928571428571,8.8842857142857135]
[null,null,null,null,null,null,null,null,null,null,null,null,null,null,null,null,null,null,null,null,null,null,null,null,null,null,null,"Grand Total",-3.0587557603681493E-3,10.373594470046079]

{"sheet":"Extract","index":3,"n_rows":103,"n_cols":54,"rows_kept":103,"cut":false,"hidden":true,"merged":[]}
[]
[null,null,null,null,null,null,null,null,null,null,null,null,null,null,null,null,null,null,null,null,null,null,null,null,"Apps","(Multiple Items)",null,null,null,"Team",1,null,null,null,null,null,null,null,"Team",2,null,null,null,null,null,null,null,"Team",3]
[null,null,"Overall",null,null,null,null,null,null,"Partners",null,null,null,null,null,null,null,null,"For Summary"]
[null,null,"PLAYER","Div","Apps","Butler","Relative",null,null,"Match",null,null,"Average of Team","Sum of Butler","Sum of MatchS","Sum of Relative",null,null,"Row Labels","Average of Guess T","Apps",null,null,null,"Row Labels","Team","Appear",null,"Rank","Row Labels","Apps","Score",1,2,3,"Sort",null,"Rank","Row Labels",null,null,1,2,3,"Sort",null,"Rank","Row Labels",null,null,1,2,3,"Sort"]
[null,null,{"$f":"Presentation!E5","v":"RB"},1,{"$f":"IFERROR(GETPIVOTDATA(\"Count of Match\",Pivots!$B$3,\"Player2\",Extract!$C$5,\"Team\",D5),\"\")","v":11},{"$f":"IFERROR(GETPIVOTDATA(\"Sum of Butler\",Pivots!$B$3,\"Player2\",$C$5,\"Team\",D5),\"\")","v":102.72},{"$f":"IFERROR(GETPIVOTDATA(\"Sum of Relative\",Pivots!$B$3,\"Player2\",$C$5,\"Team\",D5),\"\")","v":-67.897499999999994},null,null,{"$f":"Pivots!AH7","v":1},{"$f":"IFERROR(VLOOKUP(J5,Tables!$F$2:$H$40,2),\"\")","v":"Warks Sep 17"},{"$f":"Pivots!AI8","v":"GW"},{"$f":"IF(J5=0,\"\",GETPIVOTDATA(\"Average of Team\",Pivots!AH5,\"Match\",$J5,\"player2\",$L5))","v":1},{"$f":"IF(J5=0,\"\",GETPIVOTDATA(\"Sum of Butler\",Pivots!AI5,\"Match\",$J5,\"player2\",$L5))","v":-52},{"$f":"IF(J5=0,\"\",GETPIVOTDATA(\"Sum of MatchS\",Pivots!AJ5,\"Match\",$J5,\"player2\",$L5))","v":-96},{"$f":"IF(J5=0,\"\",GETPIVOTDATA(\"Sum of Relative\",Pivots!AK5,\"Match\",$J5,\"player2\",$L5))","v":-28},null,null,"AA",3,{"$f":"IFERROR(GETPIVOTDATA(\"Count of Match\",Pivots!B$3,\"Player2\",S5),\"\")","v":""},null,null,null,"AKA",3,3,null,{"$f":"IF(AD5=\"\",\"\",RANK(AJ5,$AJ$5:$AJ$42))","v":11},"AKM",{"$f":"IF(AG5=\"\",\"\",GETPIVOTDATA(\"Count of Match\",Pivots!$B$3,\"Player2\",$AD5,\"Team\",1)&\"D\")&IF(AH5=\"\",\"\",GETPIVOTDATA(\"Count of Match\",Pivots!$B$3,\"Player2\",$AD5,\"Team\",2)&\"P\")&IF(AI5=\"\",\"\",GETPIVOTDATA(\"Count of Match\",Pivots!$B$3,\"Player2\",$AD5,\"Team\",3)&\"M\")","v":"1D"},{"$f":"IF(AD5=\"\",\"\",GETPIVOTDATA(\"Sum of Relative\",Pivots!$B$3,\"Player2\",$AD5)/GETPIVOTDATA(\"Count of Match\",Pivots!$B$3,\"Player2\",$AD5))","v":-21.5},{"$f":"IFERROR(GETPIVOTDATA(\"Sum of Relative\",Pivots!$B$3,\"Player2\",$AD5,\"Team\",AG$4)/GETPIVOTDATA(\"Count of Match\",Pivots!$B$3,\"Player2\",$AD5,\"Team\",AG$4),\"\")","v":-21.5},{"$f":"IFERROR(GETPIVOTDATA(\"Sum of Relative\",Pivots!$B$3,\"Player2\",$AD5,\"Team\",AH$4)/GETPIVOTDATA(\"Count of Match\",Pivots!$B$3,\"Player2\",$AD5,\"Team\",AH$4),\"\")","v":""},{"$f":"IFERROR(GETPIVOTDATA(\"Sum of Relative\",Pivots!$B$3,\"Player2\",$AD5,\"Team\",AI$4)/GETPIVOTDATA(\"Count of Match\",Pivots!$B$3,\"Player2\",$AD5,\"Team\",AI$4),\"\")","v":""},{"$f":"IF(AG5=\"\",\"\",AG5+ROW(AD5)/100000)","v":-21.499949999999998},null,{"$f":"IF(AM5=\"\",\"\",RANK(AS5,$AS$5:$AS$42))","v":13},"JAR",{"$f":"IF(AP5=\"\",\"\",GETPIVOTDATA(\"Count of Match\",Pivots!$B$3,\"Player2\",$AM5,\"Team\",1)&\"D\")&IF(AQ5=\"\",\"\",GETPIVOTDATA(\"Count of Match\",Pivots!$B$3,\"Player2\",$AM5,\"Team\",2)&\"P\")&IF(AR5=\"\",\"\",GETPIVOTDATA(\"Count of Match\",Pivots!$B$3,\"Player2\",$AM5,\"Team\",3)&\"M\")","v":"3P2M"},{"$f":"IF(AM5=\"\",\"\",GETPIVOTDATA(\"Sum of Relative\",Pivots!$B$3,\"Player2\",$AM5)/GETPIVOTDATA(\"Count of Match\",Pivots!$B$3,\"Player2\",$AM5))","v":-10.1},{"$f":"IFERROR(GETPIVOTDATA(\"Sum of Relative\",Pivots!$B$3,\"Player2\",$AM5,\"Team\",AP$4)/GETPIVOTDATA(\"Count of Match\",Pivots!$B$3,\"Player2\",$AM5,\"Team\",AP$4),\"\")","v":""},{"$f":"IFERROR(GETPIVOTDATA(\"Sum of Relative\",Pivots!$B$3,\"Player2\",$AM5,\"Team\",AQ$4)/GETPIVOTDATA(\"Count of Match\",Pivots!$B$3,\"Player2\",$AM5,\"Team\",AQ$4),\"\")","v":-17.833333333333332},{"$f":"IFERROR(GETPIVOTDATA(\"Sum of Relative\",Pivots!$B$3,\"Player2\",$AM5,\"Team\",AR$4)/GETPIVOTDATA(\"Count of Match\",Pivots!$B$3,\"Player2\",$AM5,\"Team\",AR$4),\"\")","v":1.5},{"$f":"IF(AQ5=\"\",\"\",AQ5+ROW(AM5)/100000)","v":-17.83328333333333},null,{"$f":"IF(AV5=\"\",\"\",RANK(BB5,$BB$5:$BB$42))","v":15},"AKA",{"$f":"IF(AY5=\"\",\"\",GETPIVOTDATA(\"Count of Match\",Pivots!$B$3,\"Player2\",$AV5,\"Team\",1)&\"D\")&IF(AZ5=\"\",\"\",GETPIVOTDATA(\"Count of Match\",Pivots!$B$3,\"Player2\",$AV5,\"Team\",2)&\"P\")&IF(BA5=\"\",\"\",GETPIVOTDATA(\"Count of Match\",Pivots!$B$3,\"Player2\",$AV5,\"Team\",3)&\"M\")","v":"3M"},{"$f":"IF(AV5=\"\",\"\",GETPIVOTDATA(\"Sum of Relative\",Pivots!$B$3,\"Player2\",$AV5)/GETPIVOTDATA(\"Count of Match\",Pivots!$B$3,\"Player2\",$AV5))","v":-24.333333333333332},{"$f":"IFERROR(GETPIVOTDATA(\"Sum of Relative\",Pivots!$B$3,\"Player2\",$AV5,\"Team\",AY$4)/GETPIVOTDATA(\"Count of Match\",Pivots!$B$3,\"Player2\",$AV5,\"Team\",AY$4),\"\")","v":""},{"$f":"IFERROR(GETPIVOTDATA(\"Sum of Relative\",Pivots!$B$3,\"Player2\",$AV5,\"Team\",AZ$4)/GETPIVOTDATA(\"Count of Match\",Pivots!$B$3,\"Player2\",$AV5,\"Team\",AZ$4),\"\")","v":""},{"$f":"IFERROR(GETPIVOTDATA(\"Sum of Relative\",Pivots!$B$3,\"Player2\",$AV5,\"Team\",BA$4)/GETPIVOTDATA(\"Count of Match\",Pivots!$B$3,\"Player2\",$AV5,\"Team\",BA$4),\"\")","v":-24.333333333333332},{"$f":"IF(BA5=\"\",\"\",BA5+ROW(AV5)/100000)","v":-24.33328333333333}]
[null,null,null,2,{"$f":"IFERROR(GETPIVOTDATA(\"Count of Match\",Pivots!$B$3,\"Player2\",Extract!$C$5,\"Team\",D6),\"\")","v":""},{"$f":"IFERROR(GETPIVOTDATA(\"Sum of Butler\",Pivots!$B$3,\"Player2\",$C$5,\"Team\",D6),\"\")","v":""},{"$f":"IFERROR(GETPIVOTDATA(\"Sum of Relative\",Pivots!$B$3,\"Player2\",$C$5,\"Team\",D6),\"\")","v":""},null,null,{"$f":"Pivots!AH9","v":3},{"$f":"IFERROR(VLOOKUP(J6,Tables!$F$2:$H$40,2),\"\")","v":"Worcs Nov 17"},{"$f":"Pivots!AI10","v":"GW"},{"$f":"IF(J6=0,\"\",GETPIVOTDATA(\"Average of Team\",Pivots!AH6,\"Match\",$J6,\"player2\",$L6))","v":1},{"$f":"IF(J6=0,\"\",GETPIVOTDATA(\"Sum of Butler\",Pivots!AI6,\"Match\",$J6,\"player2\",$L6))","v":-13},{"$f":"IF(J6=0,\"\",GETPIVOTDATA(\"Sum of MatchS\",Pivots!AJ6,\"Match\",$J6,\"player2\",$L6))","v":42},{"$f":"IF(J6=0,\"\",GETPIVOTDATA(\"Sum of Relative\",Pivots!AK6,\"Match\",$J6,\"player2\",$L6))","v":-23.5},null,null,"AC",3,{"$f":"IFERROR(GETPIVOTDATA(\"Count of Match\",Pivots!B$3,\"Player2\",S6),\"\")","v":""},null,null,null,"AKM",1,1,null,13,"AW",{"$f":"IF(AG6=\"\",\"\",GETPIVOTDATA(\"Count of Match\",Pivots!$B$3,\"Player2\",$AD6,\"Team\",1)&\"D\")&IF(AH6=\"\",\"\",GETPIVOTDATA(\"Count of Match\",Pivots!$B$3,\"Player2\",$AD6,\"Team\",2)&\"P\")&IF(AI6=\"\",\"\",GETPIVOTDATA(\"Count of Match\",Pivots!$B$3,\"Player2\",$AD6,\"Team\",3)&\"M\")","v":"2D1P"},{"$f":"IF(AD6=\"\",\"\",GETPIVOTDATA(\"Sum of Relative\",Pivots!$B$3,\"Player2\",$AD6)/GETPIVOTDATA(\"Count of Match\",Pivots!$B$3,\"Player2\",$AD6))","v":-25.166666666666668},{"$f":"IFERROR(GETPIVOTDATA(\"Sum of Relative\",Pivots!$B$3,\"Player2\",$AD6,\"Team\",AG$4)/GETPIVOTDATA(\"Count of Match\",Pivots!$B$3,\"Player2\",$AD6,\"Team\",AG$4),\"\")","v":-23.875},{"$f":"IFERROR(GETPIVOTDATA(\"Sum of Relative\",Pivots!$B$3,\"Player2\",$AD6,\"Team\",AH$4)/GETPIVOTDATA(\"Count of Match\",Pivots!$B$3,\"Player2\",$AD6,\"Team\",AH$4),\"\")","v":-27.75},{"$f":"IFERROR(GETPIVOTDATA(\"Sum of Relative\",Pivots!$B$3,\"Player2\",$AD6,\"Team\",AI$4)/GETPIVOTDATA(\"Count of Match\",Pivots!$B$3,\"Player2\",$AD6,\"Team\",AI$4),\"\")","v":""},{"$f":"IF(AG6=\"\",\"\",AG6+ROW(AD6)/100000)","v":-23.874939999999999},null,8,"JC",{"$f":"IF(AP6=\"\",\"\",GETPIVOTDATA(\"Count of Match\",Pivots!$B$3,\"Player2\",$AM6,\"Team\",1)&\"D\")&IF(AQ6=\"\",\"\",GETPIVOTDATA(\"Count of Match\",Pivots!$B$3,\"Player2\",$AM6,\"Team\",2)&\"P\")&IF(AR6=\"\",\"\",GETPIVOTDATA(\"Count of Match\",Pivots!$B$3,\"Player2\",$AM6,\"Team\",3)&\"M\")","v":"1D8P"},{"$f":"IF(AM6=\"\",\"\",GETPIVOTDATA(\"Sum of Relative\",Pivots!$B$3,\"Player2\",$AM6)/GETPIVOTDATA(\"Count of Match\",Pivots!$B$3,\"Player2\",$AM6))","v":-2.9813888888888891},{"$f":"IFERROR(GETPIVOTDATA(\"Sum of Relative\",Pivots!$B$3,\"Player2\",$AM6,\"Team\",AP$4)/GETPIVOTDATA(\"Count of Match\",Pivots!$B$3,\"Player2\",$AM6,\"Team\",AP$4),\"\")","v":-6.75},{"$f":"IFERROR(GETPIVOTDATA(\"Sum of Relative\",Pivots!$B$3,\"Player2\",$AM6,\"Team\",AQ$4)/GETPIVOTDATA(\"Count of Match\",Pivots!$B$3,\"Player2\",$AM6,\"Team\",AQ$4),\"\")","v":-2.5103125000000004},{"$f":"IFERROR(GETPIVOTDATA(\"Sum of Relative\",Pivots!$B$3,\"Player2\",$AM6,\"Team\",AR$4)/GETPIVOTDATA(\"Count of Match\",Pivots!$B$3,\"Player2\",$AM6,\"Team\",AR$4),\"\")","v":""},{"$f":"IF(AQ6=\"\",\"\",AQ6+ROW(AM6)/100000)","v":-2.5102525000000004},null,9,"APR",{"$f":"IF(AY6=\"\",\"\",GETPIVOTDATA(\"Count of Match\",Pivots!$B$3,\"Player2\",$AV6,\"Team\",1)&\"D\")&IF(AZ6=\"\",\"\",GETPIVOTDATA(\"Count of Match\",Pivots!$B$3,\"Player2\",$AV6,\"Team\",2)&\"P\")&IF(BA6=\"\",\"\",GETPIVOTDATA(\"Count of Match\",Pivots!$B$3,\"Player2\",$AV6,\"Team\",3)&\"M\")","v":"4M"},{"$f":"IF(AV6=\"\",\"\",GETPIVOTDATA(\"Sum of Relative\",Pivots!$B$3,\"Player2\",$AV6)/GETPIVOTDATA(\"Count of Match\",Pivots!$B$3,\"Player2\",$AV6))","v":-3.25},{"$f":"IFERROR(GETPIVOTDATA(\"Sum of Relative\",Pivots!$B$3,\"Player2\",$AV6,\"Team\",AY$4)/GETPIVOTDATA(\"Count of Match\",Pivots!$B$3,\"Player2\",$AV6,\"Team\",AY$4),\"\")","v":""},{"$f":"IFERROR(GETPIVOTDATA(\"Sum of Relative\",Pivots!$B$3,\"Player2\",$AV6,\"Team\",AZ$4)/GETPIVOTDATA(\"Count of Match\",Pivots!$B$3,\"Player2\",$AV6,\"Team\",AZ$4),\"\")","v":""},{"$f":"IFERROR(GETPIVOTDATA(\"Sum of Relative\",Pivots!$B$3,\"Player2\",$AV6,\"Team\",BA$4)/GETPIVOTDATA(\"Count of Match\",Pivots!$B$3,\"Player2\",$AV6,\"Team\",BA$4),\"\")","v":-3.25},{"$f":"IF(BA6=\"\",\"\",BA6+ROW(AV6)/100000)","v":-3.2499400000000001}]
[null,null,null,3,{"$f":"IFERROR(GETPIVOTDATA(\"Count of Match\",Pivots!$B$3,\"Player2\",Extract!$C$5,\"Team\",D7),\"\")","v":""},{"$f":"IFERROR(GETPIVOTDATA(\"Sum of Butler\",Pivots!$B$3,\"Player2\",$C$5,\"Team\",D7),\"\")","v":""},{"$f":"IFERROR(GETPIVOTDATA(\"Sum of Relative\",Pivots!$B$3,\"Player2\",$C$5,\"Team\",D7),\"\")","v":""},null,null,{"$f":"Pivots!AH11","v":5},{"$f":"IFERROR(VLOOKUP(J7,Tables!$F$2:$H$40,2),\"\")","v":"Notts Feb 18"},{"$f":"Pivots!AI12","v":"GW"},{"$f":"IF(J7=0,\"\",GETPIVOTDATA(\"Average of Team\",Pivots!AH7,\"Match\",$J7,\"player2\",$L7))","v":1},{"$f":"IF(J7=0,\"\",GETPIVOTDATA(\"Sum of Butler\",Pivots!AI7,\"Match\",$J7,\"player2\",$L7))","v":37},{"$f":"IF(J7=0,\"\",GETPIVOTDATA(\"Sum of MatchS\",Pivots!AJ7,\"Match\",$J7,\"player2\",$L7))","v":61},{"$f":"IF(J7=0,\"\",GETPIVOTDATA(\"Sum of Relative\",Pivots!AK7,\"Match\",$J7,\"player2\",$L7))","v":21.75},null,null,"AKA",3,{"$f":"IFERROR(GETPIVOTDATA(\"Count of Match\",Pivots!B$3,\"Player2\",S7),\"\")","v":3},null,null,null,"APR",3,4,null,4,"CRO",{"$f":"IF(AG7=\"\",\"\",GETPIVOTDATA(\"Count of Match\",Pivots!$B$3,\"Player2\",$AD7,\"Team\",1)&\"D\")&IF(AH7=\"\",\"\",GETPIVOTDATA(\"Count of Match\",Pivots!$B$3,\"Player2\",$AD7,\"Team\",2)&\"P\")&IF(AI7=\"\",\"\",GETPIVOTDATA(\"Count of Match\",Pivots!$B$3,\"Player2\",$AD7,\"Team\",3)&\"M\")","v":"4D"},{"$f":"IF(AD7=\"\",\"\",GETPIVOTDATA(\"Sum of Relative\",Pivots!$B$3,\"Player2\",$AD7)/GETPIVOTDATA(\"Count of Match\",Pivots!$B$3,\"Player2\",$AD7))","v":9.2756250000000016},{"$f":"IFERROR(GETPIVOTDATA(\"Sum of Relative\",Pivots!$B$3,\"Player2\",$AD7,\"Team\",AG$4)/GETPIVOTDATA(\"Count of Match\",Pivots!$B$3,\"Player2\",$AD7,\"Team\",AG$4),\"\")","v":9.2756250000000016},{"$f":"IFERROR(GETPIVOTDATA(\"Sum of Relative\",Pivots!$B$3,\"Player2\",$AD7,\"Team\",AH$4)/GETPIVOTDATA(\"Count of Match\",Pivots!$B$3,\"Player2\",$AD7,\"Team\",AH$4),\"\")","v":""},{"$f":"IFERROR(GETPIVOTDATA(\"Sum of Relative\",Pivots!$B$3,\"Player2\",$AD7,\"Team\",AI$4)/GETPIVOTDATA(\"Count of Match\",Pivots!$B$3,\"Player2\",$AD7,\"Team\",AI$4),\"\")","v":""},9.2756950000000007,null,4,"JSI",{"$f":"IF(AP7=\"\",\"\",GETPIVOTDATA(\"Count of Match\",Pivots!$B$3,\"Player2\",$AM7,\"Team\",1)&\"D\")&IF(AQ7=\"\",\"\",GETPIVOTDATA(\"Count of Match\",Pivots!$B$3,\"Player2\",$AM7,\"Team\",2)&\"P\")&IF(AR7=\"\",\"\",GETPIVOTDATA(\"Count of Match\",Pivots!$B$3,\"Player2\",$AM7,\"Team\",3)&\"M\")","v":"7P5M"},{"$f":"IF(AM7=\"\",\"\",GETPIVOTDATA(\"Sum of Relative\",Pivots!$B$3,\"Player2\",$AM7)/GETPIVOTDATA(\"Count of Match\",Pivots!$B$3,\"Player2\",$AM7))","v":0.37416666666666742},{"$f":"IFERROR(GETPIVOTDATA(\"Sum of Relative\",Pivots!$B$3,\"Player2\",$AM7,\"Team\",AP$4)/GETPIVOTDATA(\"Count of Match\",Pivots!$B$3,\"Player2\",$AM7,\"Team\",AP$4),\"\")","v":""},{"$f":"IFERROR(GETPIVOTDATA(\"Sum of Relative\",Pivots!$B$3,\"Player2\",$AM7,\"Team\",AQ$4)/GETPIVOTDATA(\"Count of Match\",Pivots!$B$3,\"Player2\",$AM7,\"Team\",AQ$4),\"\")","v":4.5375000000000005},{"$f":"IFERROR(GETPIVOTDATA(\"Sum of Relative\",Pivots!$B$3,\"Player2\",$AM7,\"Team\",AR$4)/GETPIVOTDATA(\"Count of Match\",Pivots!$B$3,\"Player2\",$AM7,\"Team\",AR$4),\"\")","v":-5.4544999999999986},4.5375700000000005,null,13,"AS",{"$f":"IF(AY7=\"\",\"\",GETPIVOTDATA(\"Count of Match\",Pivots!$B$3,\"Player2\",$AV7,\"Team\",1)&\"D\")&IF(AZ7=\"\",\"\",GETPIVOTDATA(\"Count of Match\",Pivots!$B$3,\"Player2\",$AV7,\"Team\",2)&\"P\")&IF(BA7=\"\",\"\",GETPIVOTDATA(\"Count of Match\",Pivots!$B$3,\"Player2\",$AV7,\"Team\",3)&\"M\")","v":"1D5M"},{"$f":"IF(AV7=\"\",\"\",GETPIVOTDATA(\"Sum of Relative\",Pivots!$B$3,\"Player2\",$AV7)/GETPIVOTDATA(\"Count of Match\",Pivots!$B$3,\"Player2\",$AV7))","v":-20.897083333333331},{"$f":"IFERROR(GETPIVOTDATA(\"Sum of Relative\",Pivots!$B$3,\"Player2\",$AV7,\"Team\",AY$4)/GETPIVOTDATA(\"Count of Match\",Pivots!$B$3,\"Player2\",$AV7,\"Team\",AY$4),\"\")","v":-38.5},{"$f":"IFERROR(GETPIVOTDATA(\"Sum of Relative\",Pivots!$B$3,\"Player2\",$AV7,\"Team\",AZ$4)/GETPIVOTDATA(\"Count of Match\",Pivots!$B$3,\"Player2\",$AV7,\"Team\",AZ$4),\"\")","v":""},{"$f":"IFERROR(GETPIVOTDATA(\"Sum of Relative\",Pivots!$B$3,\"Player2\",$AV7,\"Team\",BA$4)/GETPIVOTDATA(\"Count of Match\",Pivots!$B$3,\"Player2\",$AV7,\"Team\",BA$4),\"\")","v":-17.3765},-17.376429999999999]
[null,null,null,null,null,null,null,null,null,{"$f":"Pivots!AH13","v":6},{"$f":"IFERROR(VLOOKUP(J8,Tables!$F$2:$H$40,2),\"\")","v":"Staffs Mar 18"},{"$f":"Pivots!AI14","v":"GW"},{"$f":"IF(J8=0,\"\",GETPIVOTDATA(\"Average of Team\",Pivots!AH8,\"Match\",$J8,\"player2\",$L8))","v":1},{"$f":"IF(J8=0,\"\",GETPIVOTDATA(\"Sum of Butler\",Pivots!AI8,\"Match\",$J8,\"player2\",$L8))","v":16},{"$f":"IF(J8=0,\"\",GETPIVOTDATA(\"Sum of MatchS\",Pivots!AJ8,\"Match\",$J8,\"player2\",$L8))","v":76},{"$f":"IF(J8=0,\"\",GETPIVOTDATA(\"Sum of Relative\",Pivots!AK8,\"Match\",$J8,\"player2\",$L8))","v":-3},null,null,"AKM",1,{"$f":"IFERROR(GETPIVOTDATA(\"Count of Match\",Pivots!B$3,\"Player2\",S8),\"\")","v":1},null,null,null,"AS",3,6,null,9,"GW",{"$f":"IF(AG8=\"\",\"\",GETPIVOTDATA(\"Count of Match\",Pivots!$B$3,\"Player2\",$AD8,\"Team\",1)&\"D\")&IF(AH8=\"\",\"\",GETPIVOTDATA(\"Count of Match\",Pivots!$B$3,\"Player2\",$AD8,\"Team\",2)&\"P\")&IF(AI8=\"\",\"\",GETPIVOTDATA(\"Count of Match\",Pivots!$B$3,\"Player2\",$AD8,\"Team\",3)&\"M\")","v":"10D"},{"$f":"IF(AD8=\"\",\"\",GETPIVOTDATA(\"Sum of Relative\",Pivots!$B$3,\"Player2\",$AD8)/GETPIVOTDATA(\"Count of Match\",Pivots!$B$3,\"Player2\",$AD8))","v":-10.66475},{"$f":"IFERROR(GETPIVOTDATA(\"Sum of Relative\",Pivots!$B$3,\"Player2\",$AD8,\"Team\",AG$4)/GETPIVOTDATA(\"Count of Match\",Pivots!$B$3,\"Player2\",$AD8,\"Team\",AG$4),\"\")","v":-10.66475},{"$f":"IFERROR(GETPIVOTDATA(\"Sum of Relative\",Pivots!$B$3,\"Player2\",$AD8,\"Team\",AH$4)/GETPIVOTDATA(\"Count of Match\",Pivots!$B$3,\"Player2\",$AD8,\"Team\",AH$4),\"\")","v":""},{"$f":"IFERROR(GETPIVOTDATA(\"Sum of Relative\",Pivots!$B$3,\"Player2\",$AD8,\"Team\",AI$4)/GETPIVOTDATA(\"Count of Match\",Pivots!$B$3,\"Player2\",$AD8,\"Team\",AI$4),\"\")","v":""},-10.664669999999999,null,12,"MB",{"$f":"IF(AP8=\"\",\"\",GETPIVOTDATA(\"Count of Match\",Pivots!$B$3,\"Player2\",$AM8,\"Team\",1)&\"D\")&IF(AQ8=\"\",\"\",GETPIVOTDATA(\"Count of Match\",Pivots!$B$3,\"Player2\",$AM8,\"Team\",2)&\"P\")&IF(AR8=\"\",\"\",GETPIVOTDATA(\"Count of Match\",Pivots!$B$3,\"Player2\",$AM8,\"Team\",3)&\"M\")","v":"3P3M"},{"$f":"IF(AM8=\"\",\"\",GETPIVOTDATA(\"Sum of Relative\",Pivots!$B$3,\"Player2\",$AM8)/GETPIVOTDATA(\"Count of Match\",Pivots!$B$3,\"Player2\",$AM8))","v":-13.573749999999999},{"$f":"IFERROR(GETPIVOTDATA(\"Sum of Relative\",Pivots!$B$3,\"Player2\",$AM8,\"Team\",AP$4)/GETPIVOTDATA(\"Count of Match\",Pivots!$B$3,\"Player2\",$AM8,\"Team\",AP$4),\"\")","v":""},{"$f":"IFERROR(GETPIVOTDATA(\"Sum of Relative\",Pivots!$B$3,\"Player2\",$AM8,\"Team\",AQ$4)/GETPIVOTDATA(\"Count of Match\",Pivots!$B$3,\"Player2\",$AM8,\"Team\",AQ$4),\"\")","v":-17.833333333333332},{"$f":"IFERROR(GETPIVOTDATA(\"Sum of Relative\",Pivots!$B$3,\"Player2\",$AM8,\"Team\",AR$4)/GETPIVOTDATA(\"Count of Match\",Pivots!$B$3,\"Player2\",$AM8,\"Team\",AR$4),\"\")","v":-9.3141666666666652},-17.833253333333332,null,1,"BR",{"$f":"IF(AY8=\"\",\"\",GETPIVOTDATA(\"Count of Match\",Pivots!$B$3,\"Player2\",$AV8,\"Team\",1)&\"D\")&IF(AZ8=\"\",\"\",GETPIVOTDATA(\"Count of Match\",Pivots!$B$3,\"Player2\",$AV8,\"Team\",2)&\"P\")&IF(BA8=\"\",\"\",GETPIVOTDATA(\"Count of Match\",Pivots!$B$3,\"Player2\",$AV8,\"Team\",3)&\"M\")","v":"2P3M"},{"$f":"IF(AV8=\"\",\"\",GETPIVOTDATA(\"Sum of Relative\",Pivots!$B$3,\"Player2\",$AV8)/GETPIVOTDATA(\"Count of Match\",Pivots!$B$3,\"Player2\",$AV8))","v":22.215},{"$f":"IFERROR(GETPIVOTDATA(\"Sum of Relative\",Pivots!$B$3,\"Player2\",$AV8,\"Team\",AY$4)/GETPIVOTDATA(\"Count of Match\",Pivots!$B$3,\"Player2\",$AV8,\"Team\",AY$4),\"\")","v":""},{"$f":"IFERROR(GETPIVOTDATA(\"Sum of Relative\",Pivots!$B$3,\"Player2\",$AV8,\"Team\",AZ$4)/GETPIVOTDATA(\"Count of Match\",Pivots!$B$3,\"Player2\",$AV8,\"Team\",AZ$4),\"\")","v":3.5374999999999996},{"$f":"IFERROR(GETPIVOTDATA(\"Sum of Relative\",Pivots!$B$3,\"Player2\",$AV8,\"Team\",BA$4)/GETPIVOTDATA(\"Count of Match\",Pivots!$B$3,\"Player2\",$AV8,\"Team\",BA$4),\"\")","v":34.666666666666664},34.666746666666661]
[null,null,null,"Total",{"$f":"SUM(E5:E7)","v":11},{"$f":"SUM(F5:F7)","v":102.72},{"$f":"SUM(G5:G7)","v":-67.897499999999994},null,null,{"$f":"Pivots!AH15","v":7},{"$f":"IFERROR(VLOOKUP(J9,Tables!$F$2:$H$40,2),\"\")","v":"Oxf Apr 18"},{"$f":"Pivots!AI16","v":"KST"},{"$f":"IF(J9=0,\"\",GETPIVOTDATA(\"Average of Team\",Pivots!AH9,\"Match\",$J9,\"player2\",$L9))","v":1},{"$f":"IF(J9=0,\"\",GETPIVOTDATA(\"Sum of Butler\",Pivots!AI9,\"Match\",$J9,\"player2\",$L9))","v":-19},{"$f":"IF(J9=0,\"\",GETPIVOTDATA(\"Sum of MatchS\",Pivots!AJ9,\"Match\",$J9,\"player2\",$L9))","v":71},{"$f":"IF(J9=0,\"\",GETPIVOTDATA(\"Sum of Relative\",Pivots!AK9,\"Match\",$J9,\"player2\",$L9))","v":-36.75},null,null,"APO",3,{"$f":"IFERROR(GETPIVOTDATA(\"Count of Match\",Pivots!B$3,\"Player2\",S9),\"\")","v":""},null,null,null,"AW",1,3,null,10,"JAN",{"$f":"IF(AG9=\"\",\"\",GETPIVOTDATA(\"Count of Match\",Pivots!$B$3,\"Player2\",$AD9,\"Team\",1)&\"D\")&IF(AH9=\"\",\"\",GETPIVOTDATA(\"Count of Match\",Pivots!$B$3,\"Player2\",$AD9,\"Team\",2)&\"P\")&IF(AI9=\"\",\"\",GETPIVOTDATA(\"Count of Match\",Pivots!$B$3,\"Player2\",$AD9,\"Team\",3)&\"M\")","v":"8D1P"},{"$f":"IF(AD9=\"\",\"\",GETPIVOTDATA(\"Sum of Relative\",Pivots!$B$3,\"Player2\",$AD9)/GETPIVOTDATA(\"Count of Match\",Pivots!$B$3,\"Player2\",$AD9))","v":-7.9219444444444447},{"$f":"IFERROR(GETPIVOTDATA(\"Sum of Relative\",Pivots!$B$3,\"Player2\",$AD9,\"Team\",AG$4)/GETPIVOTDATA(\"Count of Match\",Pivots!$B$3,\"Player2\",$AD9,\"Team\",AG$4),\"\")","v":-12.315},{"$f":"IFERROR(GETPIVOTDATA(\"Sum of Relative\",Pivots!$B$3,\"Player2\",$AD9,\"Team\",AH$4)/GETPIVOTDATA(\"Count of Match\",Pivots!$B$3,\"Player2\",$AD9,\"Team\",AH$4),\"\")","v":27.2225},{"$f":"IFERROR(GETPIVOTDATA(\"Sum of Relative\",Pivots!$B$3,\"Player2\",$AD9,\"Team\",AI$4)/GETPIVOTDATA(\"Count of Match\",Pivots!$B$3,\"Player2\",$AD9,\"Team\",AI$4),\"\")","v":""},-12.314909999999999,null,10,"MR",{"$f":"IF(AP9=\"\",\"\",GETPIVOTDATA(\"Count of Match\",Pivots!$B$3,\"Player2\",$AM9,\"Team\",1)&\"D\")&IF(AQ9=\"\",\"\",GETPIVOTDATA(\"Count of Match\",Pivots!$B$3,\"Player2\",$AM9,\"Team\",2)&\"P\")&IF(AR9=\"\",\"\",GETPIVOTDATA(\"Count of Match\",Pivots!$B$3,\"Player2\",$AM9,\"Team\",3)&\"M\")","v":"1D9P"},{"$f":"IF(AM9=\"\",\"\",GETPIVOTDATA(\"Sum of Relative\",Pivots!$B$3,\"Player2\",$AM9)/GETPIVOTDATA(\"Count of Match\",Pivots!$B$3,\"Player2\",$AM9))","v":-8.5832499999999996},{"$f":"IFERROR(GETPIVOTDATA(\"Sum of Relative\",Pivots!$B$3,\"Player2\",$AM9,\"Team\",AP$4)/GETPIVOTDATA(\"Count of Match\",Pivots!$B$3,\"Player2\",$AM9,\"Team\",AP$4),\"\")","v":-6.75},{"$f":"IFERROR(GETPIVOTDATA(\"Sum of Relative\",Pivots!$B$3,\"Player2\",$AM9,\"Team\",AQ$4)/GETPIVOTDATA(\"Count of Match\",Pivots!$B$3,\"Player2\",$AM9,\"Team\",AQ$4),\"\")","v":-8.7869444444444458},{"$f":"IFERROR(GETPIVOTDATA(\"Sum of Relative\",Pivots!$B$3,\"Player2\",$AM9,\"Team\",AR$4)/GETPIVOTDATA(\"Count of Match\",Pivots!$B$3,\"Player2\",$AM9,\"Team\",AR$4),\"\")","v":""},-8.7868544444444456,null,8,"DA",{"$f":"IF(AY9=\"\",\"\",GETPIVOTDATA(\"Count of Match\",Pivots!$B$3,\"Player2\",$AV9,\"Team\",1)&\"D\")&IF(AZ9=\"\",\"\",GETPIVOTDATA(\"Count of Match\",Pivots!$B$3,\"Player2\",$AV9,\"Team\",2)&\"P\")&IF(BA9=\"\",\"\",GETPIVOTDATA(\"Count of Match\",Pivots!$B$3,\"Player2\",$AV9,\"Team\",3)&\"M\")","v":"4M"},{"$f":"IF(AV9=\"\",\"\",GETPIVOTDATA(\"Sum of Relative\",Pivots!$B$3,\"Player2\",$AV9)/GETPIVOTDATA(\"Count of Match\",Pivots!$B$3,\"Player2\",$AV9))","v":-3.25},{"$f":"IFERROR(GETPIVOTDATA(\"Sum of Relative\",Pivots!$B$3,\"Player2\",$AV9,\"Team\",AY$4)/GETPIVOTDATA(\"Count of Match\",Pivots!$B$3,\"Player2\",$AV9,\"Team\",AY$4),\"\")","v":""},{"$f":"IFERROR(GETPIVOTDATA(\"Sum of Relative\",Pivots!$B$3,\"Player2\",$AV9,\"Team\",AZ$4)/GETPIVOTDATA(\"Count of Match\",Pivots!$B$3,\"Player2\",$AV9,\"Team\",AZ$4),\"\")","v":""},{"$f":"IFERROR(GETPIVOTDATA(\"Sum of Relative\",Pivots!$B$3,\"Player2\",$AV9,\"Team\",BA$4)/GETPIVOTDATA(\"Count of Match\",Pivots!$B$3,\"Player2\",$AV9,\"Team\",BA$4),\"\")","v":-3.25},-3.2499099999999999]
[null,null,null,null,null,null,null,null,null,{"$f":"Pivots!AH17","v":11},{"$f":"IFERROR(VLOOKUP(J10,Tables!$F$2:$H$40,2),\"\")","v":"Lei Sep 18"},{"$f":"Pivots!AI18","v":"GW"},{"$f":"IF(J10=0,\"\",GETPIVOTDATA(\"Average of Team\",Pivots!AH10,\"Match\",$J10,\"player2\",$L10))","v":1},{"$f":"IF(J10=0,\"\",GETPIVOTDATA(\"Sum of Butler\",Pivots!AI10,\"Match\",$J10,\"player2\",$L10))","v":-11},{"$f":"IF(J10=0,\"\",GETPIVOTDATA(\"Sum of MatchS\",Pivots!AJ10,\"Match\",$J10,\"player2\",$L10))","v":-1},{"$f":"IF(J10=0,\"\",GETPIVOTDATA(\"Sum of Relative\",Pivots!AK10,\"Match\",$J10,\"player2\",$L10))","v":-10.75},null,null,"APR",3,{"$f":"IFERROR(GETPIVOTDATA(\"Count of Match\",Pivots!B$3,\"Player2\",S10),\"\")","v":4},null,null,null,"BR",3,5,null,3,"JAT",{"$f":"IF(AG10=\"\",\"\",GETPIVOTDATA(\"Count of Match\",Pivots!$B$3,\"Player2\",$AD10,\"Team\",1)&\"D\")&IF(AH10=\"\",\"\",GETPIVOTDATA(\"Count of Match\",Pivots!$B$3,\"Player2\",$AD10,\"Team\",2)&\"P\")&IF(AI10=\"\",\"\",GETPIVOTDATA(\"Count of Match\",Pivots!$B$3,\"Player2\",$AD10,\"Team\",3)&\"M\")","v":"4D"},{"$f":"IF(AD10=\"\",\"\",GETPIVOTDATA(\"Sum of Relative\",Pivots!$B$3,\"Player2\",$AD10)/GETPIVOTDATA(\"Count of Match\",Pivots!$B$3,\"Player2\",$AD10))","v":9.2756250000000016},{"$f":"IFERROR(GETPIVOTDATA(\"Sum of Relative\",Pivots!$B$3,\"Player2\",$AD10,\"Team\",AG$4)/GETPIVOTDATA(\"Count of Match\",Pivots!$B$3,\"Player2\",$AD10,\"Team\",AG$4),\"\")","v":9.2756250000000016},{"$f":"IFERROR(GETPIVOTDATA(\"Sum of Relative\",Pivots!$B$3,\"Player2\",$AD10,\"Team\",AH$4)/GETPIVOTDATA(\"Count of Match\",Pivots!$B$3,\"Player2\",$AD10,\"Team\",AH$4),\"\")","v":""},{"$f":"IFERROR(GETPIVOTDATA(\"Sum of Relative\",Pivots!$B$3,\"Player2\",$AD10,\"Team\",AI$4)/GETPIVOTDATA(\"Count of Match\",Pivots!$B$3,\"Player2\",$AD10,\"Team\",AI$4),\"\")","v":""},9.2757250000000013,null,6,"MW",{"$f":"IF(AP10=\"\",\"\",GETPIVOTDATA(\"Count of Match\",Pivots!$B$3,\"Player2\",$AM10,\"Team\",1)&\"D\")&IF(AQ10=\"\",\"\",GETPIVOTDATA(\"Count of Match\",Pivots!$B$3,\"Player2\",$AM10,\"Team\",2)&\"P\")&IF(AR10=\"\",\"\",GETPIVOTDATA(\"Count of Match\",Pivots!$B$3,\"Player2\",$AM10,\"Team\",3)&\"M\")","v":"7P2M"},{"$f":"IF(AM10=\"\",\"\",GETPIVOTDATA(\"Sum of Relative\",Pivots!$B$3,\"Player2\",$AM10)/GETPIVOTDATA(\"Count of Match\",Pivots!$B$3,\"Player2\",$AM10))","v":-1.0469444444444445},{"$f":"IFERROR(GETPIVOTDATA(\"Sum of Relative\",Pivots!$B$3,\"Player2\",$AM10,\"Team\",AP$4)/GETPIVOTDATA(\"Count of Match\",Pivots!$B$3,\"Player2\",$AM10,\"Team\",AP$4),\"\")","v":""},{"$f":"IFERROR(GETPIVOTDATA(\"Sum of Relative\",Pivots!$B$3,\"Player2\",$AM10,\"Team\",AQ$4)/GETPIVOTDATA(\"Count of Match\",Pivots!$B$3,\"Player2\",$AM10,\"Team\",AQ$4),\"\")","v":-1.774642857142857},{"$f":"IFERROR(GETPIVOTDATA(\"Sum of Relative\",Pivots!$B$3,\"Player2\",$AM10,\"Team\",AR$4)/GETPIVOTDATA(\"Count of Match\",Pivots!$B$3,\"Player2\",$AM10,\"Team\",AR$4),\"\")","v":1.5},-1.774542857142857,null,12,"JuS",{"$f":"IF(AY10=\"\",\"\",GETPIVOTDATA(\"Count of Match\",Pivots!$B$3,\"Player2\",$AV10,\"Team\",1)&\"D\")&IF(AZ10=\"\",\"\",GETPIVOTDATA(\"Count of Match\",Pivots!$B$3,\"Player2\",$AV10,\"Team\",2)&\"P\")&IF(BA10=\"\",\"\",GETPIVOTDATA(\"Count of Match\",Pivots!$B$3,\"Player2\",$AV10,\"Team\",3)&\"M\")","v":"4M"},{"$f":"IF(AV10=\"\",\"\",GETPIVOTDATA(\"Sum of Relative\",Pivots!$B$3,\"Player2\",$AV10)/GETPIVOTDATA(\"Count of Match\",Pivots!$B$3,\"Player2\",$AV10))","v":-12.595624999999998},{"$f":"IFERROR(GETPIVOTDATA(\"Sum of Relative\",Pivots!$B$3,\"Player2\",$AV10,\"Team\",AY$4)/GETPIVOTDATA(\"Count of Match\",Pivots!$B$3,\"Player2\",$AV10,\"Team\",AY$4),\"\")","v":""},{"$f":"IFERROR(GETPIVOTDATA(\"Sum of Relative\",Pivots!$B$3,\"Player2\",$AV10,\"Team\",AZ$4)/GETPIVOTDATA(\"Count of Match\",Pivots!$B$3,\"Player2\",$AV10,\"Team\",AZ$4),\"\")","v":""},{"$f":"IFERROR(GETPIVOTDATA(\"Sum of Relative\",Pivots!$B$3,\"Player2\",$AV10,\"Team\",BA$4)/GETPIVOTDATA(\"Count of Match\",Pivots!$B$3,\"Player2\",$AV10,\"Team\",BA$4),\"\")","v":-12.595624999999998},-12.595524999999999]
[null,null,null,null,null,null,null,null,null,{"$f":"Pivots!AH19","v":12},{"$f":"IFERROR(VLOOKUP(J11,Tables!$F$2:$H$40,2),\"\")","v":"Wor Oct 18"},{"$f":"Pivots!AI20","v":"GW"},{"$f":"IF(J11=0,\"\",GETPIVOTDATA(\"Average of Team\",Pivots!AH11,\"Match\",$J11,\"player2\",$L11))","v":1},{"$f":"IF(J11=0,\"\",GETPIVOTDATA(\"Sum of Butler\",Pivots!AI11,\"Match\",$J11,\"player2\",$L11))","v":9.5399999999999991},{"$f":"IF(J11=0,\"\",GETPIVOTDATA(\"Sum of MatchS\",Pivots!AJ11,\"Match\",$J11,\"player2\",$L11))","v":99.86999999999999},{"$f":"IF(J11=0,\"\",GETPIVOTDATA(\"Sum of Relative\",Pivots!AK11,\"Match\",$J11,\"player2\",$L11))","v":-15.427499999999998},null,null,"AS",3,{"$f":"IFERROR(GETPIVOTDATA(\"Count of Match\",Pivots!B$3,\"Player2\",S11),\"\")","v":6},null,null,null,"CRO",1,4,null,7,"KST",{"$f":"IF(AG11=\"\",\"\",GETPIVOTDATA(\"Count of Match\",Pivots!$B$3,\"Player2\",$AD11,\"Team\",1)&\"D\")&IF(AH11=\"\",\"\",GETPIVOTDATA(\"Count of Match\",Pivots!$B$3,\"Player2\",$AD11,\"Team\",2)&\"P\")&IF(AI11=\"\",\"\",GETPIVOTDATA(\"Count of Match\",Pivots!$B$3,\"Player2\",$AD11,\"Team\",3)&\"M\")","v":"7D1P"},{"$f":"IF(AD11=\"\",\"\",GETPIVOTDATA(\"Sum of Relative\",Pivots!$B$3,\"Player2\",$AD11)/GETPIVOTDATA(\"Count of Match\",Pivots!$B$3,\"Player2\",$AD11))","v":0.68156250000000007},{"$f":"IFERROR(GETPIVOTDATA(\"Sum of Relative\",Pivots!$B$3,\"Player2\",$AD11,\"Team\",AG$4)/GETPIVOTDATA(\"Count of Match\",Pivots!$B$3,\"Player2\",$AD11,\"Team\",AG$4),\"\")","v":-3.11},{"$f":"IFERROR(GETPIVOTDATA(\"Sum of Relative\",Pivots!$B$3,\"Player2\",$AD11,\"Team\",AH$4)/GETPIVOTDATA(\"Count of Match\",Pivots!$B$3,\"Player2\",$AD11,\"Team\",AH$4),\"\")","v":27.2225},{"$f":"IFERROR(GETPIVOTDATA(\"Sum of Relative\",Pivots!$B$3,\"Player2\",$AD11,\"Team\",AI$4)/GETPIVOTDATA(\"Count of Match\",Pivots!$B$3,\"Player2\",$AD11,\"Team\",AI$4),\"\")","v":""},-3.10989,null,3,"PL",{"$f":"IF(AP11=\"\",\"\",GETPIVOTDATA(\"Count of Match\",Pivots!$B$3,\"Player2\",$AM11,\"Team\",1)&\"D\")&IF(AQ11=\"\",\"\",GETPIVOTDATA(\"Count of Match\",Pivots!$B$3,\"Player2\",$AM11,\"Team\",2)&\"P\")&IF(AR11=\"\",\"\",GETPIVOTDATA(\"Count of Match\",Pivots!$B$3,\"Player2\",$AM11,\"Team\",3)&\"M\")","v":"6P3M"},{"$f":"IF(AM11=\"\",\"\",GETPIVOTDATA(\"Sum of Relative\",Pivots!$B$3,\"Player2\",$AM11)/GETPIVOTDATA(\"Count of Match\",Pivots!$B$3,\"Player2\",$AM11))","v":10.966111111111111},{"$f":"IFERROR(GETPIVOTDATA(\"Sum of Relative\",Pivots!$B$3,\"Player2\",$AM11,\"Team\",AP$4)/GETPIVOTDATA(\"Count of Match\",Pivots!$B$3,\"Player2\",$AM11,\"Team\",AP$4),\"\")","v":""},{"$f":"IFERROR(GETPIVOTDATA(\"Sum of Relative\",Pivots!$B$3,\"Player2\",$AM11,\"Team\",AQ$4)/GETPIVOTDATA(\"Count of Match\",Pivots!$B$3,\"Player2\",$AM11,\"Team\",AQ$4),\"\")","v":9.9491666666666667},{"$f":"IFERROR(GETPIVOTDATA(\"Sum of Relative\",Pivots!$B$3,\"Player2\",$AM11,\"Team\",AR$4)/GETPIVOTDATA(\"Count of Match\",Pivots!$B$3,\"Player2\",$AM11,\"Team\",AR$4),\"\")","v":13},9.9492766666666661,null,10,"KAS",{"$f":"IF(AY11=\"\",\"\",GETPIVOTDATA(\"Count of Match\",Pivots!$B$3,\"Player2\",$AV11,\"Team\",1)&\"D\")&IF(AZ11=\"\",\"\",GETPIVOTDATA(\"Count of Match\",Pivots!$B$3,\"Player2\",$AV11,\"Team\",2)&\"P\")&IF(BA11=\"\",\"\",GETPIVOTDATA(\"Count of Match\",Pivots!$B$3,\"Player2\",$AV11,\"Team\",3)&\"M\")","v":"2M"},{"$f":"IF(AV11=\"\",\"\",GETPIVOTDATA(\"Sum of Relative\",Pivots!$B$3,\"Player2\",$AV11)/GETPIVOTDATA(\"Count of Match\",Pivots!$B$3,\"Player2\",$AV11))","v":-4.6587499999999995},{"$f":"IFERROR(GETPIVOTDATA(\"Sum of Relative\",Pivots!$B$3,\"Player2\",$AV11,\"Team\",AY$4)/GETPIVOTDATA(\"Count of Match\",Pivots!$B$3,\"Player2\",$AV11,\"Team\",AY$4),\"\")","v":""},{"$f":"IFERROR(GETPIVOTDATA(\"Sum of Relative\",Pivots!$B$3,\"Player2\",$AV11,\"Team\",AZ$4)/GETPIVOTDATA(\"Count of Match\",Pivots!$B$3,\"Player2\",$AV11,\"Team\",AZ$4),\"\")","v":""},{"$f":"IFERROR(GETPIVOTDATA(\"Sum of Relative\",Pivots!$B$3,\"Player2\",$AV11,\"Team\",BA$4)/GETPIVOTDATA(\"Count of Match\",Pivots!$B$3,\"Player2\",$AV11,\"Team\",BA$4),\"\")","v":-4.6587499999999995},-4.6586399999999992]
[null,null,"From 2013",null,null,null,null,null,null,{"$f":"Pivots!AH21","v":13},{"$f":"IFERROR(VLOOKUP(J12,Tables!$F$2:$H$40,2),\"\")","v":"Oxf Nov 18"},{"$f":"Pivots!AI22","v":"GW"},{"$f":"IF(J12=0,\"\",GETPIVOTDATA(\"Average of Team\",Pivots!AH12,\"Match\",$J12,\"player2\",$L12))","v":1},{"$f":"IF(J12=0,\"\",GETPIVOTDATA(\"Sum of Butler\",Pivots!AI12,\"Match\",$J12,\"player2\",$L12))","v":26},{"$f":"IF(J12=0,\"\",GETPIVOTDATA(\"Sum of MatchS\",Pivots!AJ12,\"Match\",$J12,\"player2\",$L12))","v":69},{"$f":"IF(J12=0,\"\",GETPIVOTDATA(\"Sum of Relative\",Pivots!AK12,\"Match\",$J12,\"player2\",$L12))","v":8.75},null,null,"AW",1,{"$f":"IFERROR(GETPIVOTDATA(\"Count of Match\",Pivots!B$3,\"Player2\",S12),\"\")","v":3},null,null,null,"DA",3,4,null,5,"PD",{"$f":"IF(AG12=\"\",\"\",GETPIVOTDATA(\"Count of Match\",Pivots!$B$3,\"Player2\",$AD12,\"Team\",1)&\"D\")&IF(AH12=\"\",\"\",GETPIVOTDATA(\"Count of Match\",Pivots!$B$3,\"Player2\",$AD12,\"Team\",2)&\"P\")&IF(AI12=\"\",\"\",GETPIVOTDATA(\"Count of Match\",Pivots!$B$3,\"Player2\",$AD12,\"Team\",3)&\"M\")","v":"12D"},{"$f":"IF(AD12=\"\",\"\",GETPIVOTDATA(\"Sum of Relative\",Pivots!$B$3,\"Player2\",$AD12)/GETPIVOTDATA(\"Count of Match\",Pivots!$B$3,\"Player2\",$AD12))","v":8.1993749999999999},{"$f":"IFERROR(GETPIVOTDATA(\"Sum of Relative\",Pivots!$B$3,\"Player2\",$AD12,\"Team\",AG$4)/GETPIVOTDATA(\"Count of Match\",Pivots!$B$3,\"Player2\",$AD12,\"Team\",AG$4),\"\")","v":8.1993749999999999},{"$f":"IFERROR(GETPIVOTDATA(\"Sum of Relative\",Pivots!$B$3,\"Player2\",$AD12,\"Team\",AH$4)/GETPIVOTDATA(\"Count of Match\",Pivots!$B$3,\"Player2\",$AD12,\"Team\",AH$4),\"\")","v":""},{"$f":"IFERROR(GETPIVOTDATA(\"Sum of Relative\",Pivots!$B$3,\"Player2\",$AD12,\"Team\",AI$4)/GETPIVOTDATA(\"Count of Match\",Pivots!$B$3,\"Player2\",$AD12,\"Team\",AI$4),\"\")","v":""},8.1994950000000006,null,5,"PPE",{"$f":"IF(AP12=\"\",\"\",GETPIVOTDATA(\"Count of Match\",Pivots!$B$3,\"Player2\",$AM12,\"Team\",1)&\"D\")&IF(AQ12=\"\",\"\",GETPIVOTDATA(\"Count of Match\",Pivots!$B$3,\"Player2\",$AM12,\"Team\",2)&\"P\")&IF(AR12=\"\",\"\",GETPIVOTDATA(\"Count of Match\",Pivots!$B$3,\"Player2\",$AM12,\"Team\",3)&\"M\")","v":"6P"},{"$f":"IF(AM12=\"\",\"\",GETPIVOTDATA(\"Sum of Relative\",Pivots!$B$3,\"Player2\",$AM12)/GETPIVOTDATA(\"Count of Match\",Pivots!$B$3,\"Player2\",$AM12))","v":2.875},{"$f":"IFERROR(GETPIVOTDATA(\"Sum of Relative\",Pivots!$B$3,\"Player2\",$AM12,\"Team\",AP$4)/GETPIVOTDATA(\"Count of Match\",Pivots!$B$3,\"Player2\",$AM12,\"Team\",AP$4),\"\")","v":""},{"$f":"IFERROR(GETPIVOTDATA(\"Sum of Relative\",Pivots!$B$3,\"Player2\",$AM12,\"Team\",AQ$4)/GETPIVOTDATA(\"Count of Match\",Pivots!$B$3,\"Player2\",$AM12,\"Team\",AQ$4),\"\")","v":2.875},{"$f":"IFERROR(GETPIVOTDATA(\"Sum of Relative\",Pivots!$B$3,\"Player2\",$AM12,\"Team\",AR$4)/GETPIVOTDATA(\"Count of Match\",Pivots!$B$3,\"Player2\",$AM12,\"Team\",AR$4),\"\")","v":""},2.8751199999999999,null,14,"LH",{"$f":"IF(AY12=\"\",\"\",GETPIVOTDATA(\"Count of Match\",Pivots!$B$3,\"Player2\",$AV12,\"Team\",1)&\"D\")&IF(AZ12=\"\",\"\",GETPIVOTDATA(\"Count of Match\",Pivots!$B$3,\"Player2\",$AV12,\"Team\",2)&\"P\")&IF(BA12=\"\",\"\",GETPIVOTDATA(\"Count of Match\",Pivots!$B$3,\"Player2\",$AV12,\"Team\",3)&\"M\")","v":"3M"},{"$f":"IF(AV12=\"\",\"\",GETPIVOTDATA(\"Sum of Relative\",Pivots!$B$3,\"Player2\",$AV12)/GETPIVOTDATA(\"Count of Match\",Pivots!$B$3,\"Player2\",$AV12))","v":-24.333333333333332},{"$f":"IFERROR(GETPIVOTDATA(\"Sum of Relative\",Pivots!$B$3,\"Player2\",$AV12,\"Team\",AY$4)/GETPIVOTDATA(\"Count of Match\",Pivots!$B$3,\"Player2\",$AV12,\"Team\",AY$4),\"\")","v":""},{"$f":"IFERROR(GETPIVOTDATA(\"Sum of Relative\",Pivots!$B$3,\"Player2\",$AV12,\"Team\",AZ$4)/GETPIVOTDATA(\"Count of Match\",Pivots!$B$3,\"Player2\",$AV12,\"Team\",AZ$4),\"\")","v":""},{"$f":"IFERROR(GETPIVOTDATA(\"Sum of Relative\",Pivots!$B$3,\"Player2\",$AV12,\"Team\",BA$4)/GETPIVOTDATA(\"Count of Match\",Pivots!$B$3,\"Player2\",$AV12,\"Team\",BA$4),\"\")","v":-24.333333333333332},-24.333213333333333]
[null,null,"PLAYER","Div","Apps","Butler","Relative",null,null,{"$f":"Pivots!AH23","v":14},{"$f":"IFERROR(VLOOKUP(J13,Tables!$F$2:$H$40,2),\"\")","v":" Notts Jan19"},{"$f":"Pivots!AI24","v":"GW"},{"$f":"IF(J13=0,\"\",GETPIVOTDATA(\"Average of Team\",Pivots!AH13,\"Match\",$J13,\"player2\",$L13))","v":1},{"$f":"IF(J13=0,\"\",GETPIVOTDATA(\"Sum of Butler\",Pivots!AI13,\"Match\",$J13,\"player2\",$L13))","v":20},{"$f":"IF(J13=0,\"\",GETPIVOTDATA(\"Sum of MatchS\",Pivots!AJ13,\"Match\",$J13,\"player2\",$L13))","v":121},{"$f":"IF(J13=0,\"\",GETPIVOTDATA(\"Sum of Relative\",Pivots!AK13,\"Match\",$J13,\"player2\",$L13))","v":-10.25},null,null,"BG",2,{"$f":"IFERROR(GETPIVOTDATA(\"Count of Match\",Pivots!B$3,\"Player2\",S13),\"\")","v":""},null,null,null,"GW",1,10,null,1,"PSH",{"$f":"IF(AG13=\"\",\"\",GETPIVOTDATA(\"Count of Match\",Pivots!$B$3,\"Player2\",$AD13,\"Team\",1)&\"D\")&IF(AH13=\"\",\"\",GETPIVOTDATA(\"Count of Match\",Pivots!$B$3,\"Player2\",$AD13,\"Team\",2)&\"P\")&IF(AI13=\"\",\"\",GETPIVOTDATA(\"Count of Match\",Pivots!$B$3,\"Player2\",$AD13,\"Team\",3)&\"M\")","v":"10D"},{"$f":"IF(AD13=\"\",\"\",GETPIVOTDATA(\"Sum of Relative\",Pivots!$B$3,\"Player2\",$AD13)/GETPIVOTDATA(\"Count of Match\",Pivots!$B$3,\"Player2\",$AD13))","v":15.867250000000002},{"$f":"IFERROR(GETPIVOTDATA(\"Sum of Relative\",Pivots!$B$3,\"Player2\",$AD13,\"Team\",AG$4)/GETPIVOTDATA(\"Count of Match\",Pivots!$B$3,\"Player2\",$AD13,\"Team\",AG$4),\"\")","v":15.867250000000002},{"$f":"IFERROR(GETPIVOTDATA(\"Sum of Relative\",Pivots!$B$3,\"Player2\",$AD13,\"Team\",AH$4)/GETPIVOTDATA(\"Count of Match\",Pivots!$B$3,\"Player2\",$AD13,\"Team\",AH$4),\"\")","v":""},{"$f":"IFERROR(GETPIVOTDATA(\"Sum of Relative\",Pivots!$B$3,\"Player2\",$AD13,\"Team\",AI$4)/GETPIVOTDATA(\"Count of Match\",Pivots!$B$3,\"Player2\",$AD13,\"Team\",AI$4),\"\")","v":""},15.867380000000002,null,1,"PPH",{"$f":"IF(AP13=\"\",\"\",GETPIVOTDATA(\"Count of Match\",Pivots!$B$3,\"Player2\",$AM13,\"Team\",1)&\"D\")&IF(AQ13=\"\",\"\",GETPIVOTDATA(\"Count of Match\",Pivots!$B$3,\"Player2\",$AM13,\"Team\",2)&\"P\")&IF(AR13=\"\",\"\",GETPIVOTDATA(\"Count of Match\",Pivots!$B$3,\"Player2\",$AM13,\"Team\",3)&\"M\")","v":"8P1M"},{"$f":"IF(AM13=\"\",\"\",GETPIVOTDATA(\"Sum of Relative\",Pivots!$B$3,\"Player2\",$AM13)/GETPIVOTDATA(\"Count of Match\",Pivots!$B$3,\"Player2\",$AM13))","v":9.3197222222222216},{"$f":"IFERROR(GETPIVOTDATA(\"Sum of Relative\",Pivots!$B$3,\"Player2\",$AM13,\"Team\",AP$4)/GETPIVOTDATA(\"Count of Match\",Pivots!$B$3,\"Player2\",$AM13,\"Team\",AP$4),\"\")","v":""},{"$f":"IFERROR(GETPIVOTDATA(\"Sum of Relative\",Pivots!$B$3,\"Player2\",$AM13,\"Team\",AQ$4)/GETPIVOTDATA(\"Count of Match\",Pivots!$B$3,\"Player2\",$AM13,\"Team\",AQ$4),\"\")","v":10.1096875},{"$f":"IFERROR(GETPIVOTDATA(\"Sum of Relative\",Pivots!$B$3,\"Player2\",$AM13,\"Team\",AR$4)/GETPIVOTDATA(\"Count of Match\",Pivots!$B$3,\"Player2\",$AM13,\"Team\",AR$4),\"\")","v":3},10.1098175,null,16,"ML",{"$f":"IF(AY13=\"\",\"\",GETPIVOTDATA(\"Count of Match\",Pivots!$B$3,\"Player2\",$AV13,\"Team\",1)&\"D\")&IF(AZ13=\"\",\"\",GETPIVOTDATA(\"Count of Match\",Pivots!$B$3,\"Player2\",$AV13,\"Team\",2)&\"P\")&IF(BA13=\"\",\"\",GETPIVOTDATA(\"Count of Match\",Pivots!$B$3,\"Player2\",$AV13,\"Team\",3)&\"M\")","v":"1M"},{"$f":"IF(AV13=\"\",\"\",GETPIVOTDATA(\"Sum of Relative\",Pivots!$B$3,\"Player2\",$AV13)/GETPIVOTDATA(\"Count of Match\",Pivots!$B$3,\"Player2\",$AV13))","v":-26.5},{"$f":"IFERROR(GETPIVOTDATA(\"Sum of Relative\",Pivots!$B$3,\"Player2\",$AV13,\"Team\",AY$4)/GETPIVOTDATA(\"Count of Match\",Pivots!$B$3,\"Player2\",$AV13,\"Team\",AY$4),\"\")","v":""},{"$f":"IFERROR(GETPIVOTDATA(\"Sum of Relative\",Pivots!$B$3,\"Player2\",$AV13,\"Team\",AZ$4)/GETPIVOTDATA(\"Count of Match\",Pivots!$B$3,\"Player2\",$AV13,\"Team\",AZ$4),\"\")","v":""},{"$f":"IFERROR(GETPIVOTDATA(\"Sum of Relative\",Pivots!$B$3,\"Player2\",$AV13,\"Team\",BA$4)/GETPIVOTDATA(\"Count of Match\",Pivots!$B$3,\"Player2\",$AV13,\"Team\",BA$4),\"\")","v":-26.5},-26.499870000000001]
[null,null,null,1,{"$f":"IFERROR(GETPIVOTDATA(\"Count of Match\",Pivots!$K$3,\"Player2\",Extract!$C$5,\"Team\",D14),\"\")","v":5},{"$f":"IFERROR(GETPIVOTDATA(\"Sum of Butler\",Pivots!$K$3,\"Player2\",$C$5,\"Team\",D14),\"\")","v":73.180000000000007},{"$f":"IFERROR(GETPIVOTDATA(\"Sum of Relative\",Pivots!$K$3,\"Player2\",$C$5,\"Team\",D14),\"\")","v":-7.9699999999999989},null,null,{"$f":"Pivots!AH25","v":15},{"$f":"IFERROR(VLOOKUP(J14,Tables!$F$2:$H$40,2),\"\")","v":"Staffs Feb 19"},{"$f":"Pivots!AI26","v":"GW"},{"$f":"IF(J14=0,\"\",GETPIVOTDATA(\"Average of Team\",Pivots!AH14,\"Match\",$J14,\"player2\",$L14))","v":1},{"$f":"IF(J14=0,\"\",GETPIVOTDATA(\"Sum of Butler\",Pivots!AI14,\"Match\",$J14,\"player2\",$L14))","v":2},{"$f":"IF(J14=0,\"\",GETPIVOTDATA(\"Sum of MatchS\",Pivots!AJ14,\"Match\",$J14,\"player2\",$L14))","v":57},{"$f":"IF(J14=0,\"\",GETPIVOTDATA(\"Sum of Relative\",Pivots!AK14,\"Match\",$J14,\"player2\",$L14))","v":-12.25},null,null,"BR",3,{"$f":"IFERROR(GETPIVOTDATA(\"Count of Match\",Pivots!B$3,\"Player2\",S14),\"\")","v":5},null,null,null,"JAN",1,9,null,8,"RB",{"$f":"IF(AG14=\"\",\"\",GETPIVOTDATA(\"Count of Match\",Pivots!$B$3,\"Player2\",$AD14,\"Team\",1)&\"D\")&IF(AH14=\"\",\"\",GETPIVOTDATA(\"Count of Match\",Pivots!$B$3,\"Player2\",$AD14,\"Team\",2)&\"P\")&IF(AI14=\"\",\"\",GETPIVOTDATA(\"Count of Match\",Pivots!$B$3,\"Player2\",$AD14,\"Team\",3)&\"M\")","v":"11D"},{"$f":"IF(AD14=\"\",\"\",GETPIVOTDATA(\"Sum of Relative\",Pivots!$B$3,\"Player2\",$AD14)/GETPIVOTDATA(\"Count of Match\",Pivots!$B$3,\"Player2\",$AD14))","v":-6.1724999999999994},{"$f":"IFERROR(GETPIVOTDATA(\"Sum of Relative\",Pivots!$B$3,\"Player2\",$AD14,\"Team\",AG$4)/GETPIVOTDATA(\"Count of Match\",Pivots!$B$3,\"Player2\",$AD14,\"Team\",AG$4),\"\")","v":-6.1724999999999994},{"$f":"IFERROR(GETPIVOTDATA(\"Sum of Relative\",Pivots!$B$3,\"Player2\",$AD14,\"Team\",AH$4)/GETPIVOTDATA(\"Count of Match\",Pivots!$B$3,\"Player2\",$AD14,\"Team\",AH$4),\"\")","v":""},{"$f":"IFERROR(GETPIVOTDATA(\"Sum of Relative\",Pivots!$B$3,\"Player2\",$AD14,\"Team\",AI$4)/GETPIVOTDATA(\"Count of Match\",Pivots!$B$3,\"Player2\",$AD14,\"Team\",AI$4),\"\")","v":""},-6.1723599999999994,null,2,"PSW",{"$f":"IF(AP14=\"\",\"\",GETPIVOTDATA(\"Count of Match\",Pivots!$B$3,\"Player2\",$AM14,\"Team\",1)&\"D\")&IF(AQ14=\"\",\"\",GETPIVOTDATA(\"Count of Match\",Pivots!$B$3,\"Player2\",$AM14,\"Team\",2)&\"P\")&IF(AR14=\"\",\"\",GETPIVOTDATA(\"Count of Match\",Pivots!$B$3,\"Player2\",$AM14,\"Team\",3)&\"M\")","v":"6P3M"},{"$f":"IF(AM14=\"\",\"\",GETPIVOTDATA(\"Sum of Relative\",Pivots!$B$3,\"Player2\",$AM14)/GETPIVOTDATA(\"Count of Match\",Pivots!$B$3,\"Player2\",$AM14))","v":10.966111111111111},{"$f":"IFERROR(GETPIVOTDATA(\"Sum of Relative\",Pivots!$B$3,\"Player2\",$AM14,\"Team\",AP$4)/GETPIVOTDATA(\"Count of Match\",Pivots!$B$3,\"Player2\",$AM14,\"Team\",AP$4),\"\")","v":""},{"$f":"IFERROR(GETPIVOTDATA(\"Sum of Relative\",Pivots!$B$3,\"Player2\",$AM14,\"Team\",AQ$4)/GETPIVOTDATA(\"Count of Match\",Pivots!$B$3,\"Player2\",$AM14,\"Team\",AQ$4),\"\")","v":9.9491666666666667},{"$f":"IFERROR(GETPIVOTDATA(\"Sum of Relative\",Pivots!$B$3,\"Player2\",$AM14,\"Team\",AR$4)/GETPIVOTDATA(\"Count of Match\",Pivots!$B$3,\"Player2\",$AM14,\"Team\",AR$4),\"\")","v":13},9.9493066666666667,null,7,"PW",{"$f":"IF(AY14=\"\",\"\",GETPIVOTDATA(\"Count of Match\",Pivots!$B$3,\"Player2\",$AV14,\"Team\",1)&\"D\")&IF(AZ14=\"\",\"\",GETPIVOTDATA(\"Count of Match\",Pivots!$B$3,\"Player2\",$AV14,\"Team\",2)&\"P\")&IF(BA14=\"\",\"\",GETPIVOTDATA(\"Count of Match\",Pivots!$B$3,\"Player2\",$AV14,\"Team\",3)&\"M\")","v":"1P11M"},{"$f":"IF(AV14=\"\",\"\",GETPIVOTDATA(\"Sum of Relative\",Pivots!$B$3,\"Player2\",$AV14)/GETPIVOTDATA(\"Count of Match\",Pivots!$B$3,\"Player2\",$AV14))","v":-0.27416666666666673},{"$f":"IFERROR(GETPIVOTDATA(\"Sum of Relative\",Pivots!$B$3,\"Player2\",$AV14,\"Team\",AY$4)/GETPIVOTDATA(\"Count of Match\",Pivots!$B$3,\"Player2\",$AV14,\"Team\",AY$4),\"\")","v":""},{"$f":"IFERROR(GETPIVOTDATA(\"Sum of Relative\",Pivots!$B$3,\"Player2\",$AV14,\"Team\",AZ$4)/GETPIVOTDATA(\"Count of Match\",Pivots!$B$3,\"Player2\",$AV14,\"Team\",AZ$4),\"\")","v":-7.5},{"$f":"IFERROR(GETPIVOTDATA(\"Sum of Relative\",Pivots!$B$3,\"Player2\",$AV14,\"Team\",BA$4)/GETPIVOTDATA(\"Count of Match\",Pivots!$B$3,\"Player2\",$AV14,\"Team\",BA$4),\"\")","v":0.38272727272727264},0.38286727272727261]
[null,null,null,2,{"$f":"IFERROR(GETPIVOTDATA(\"Count of Match\",Pivots!$K$3,\"Player2\",Extract!$C$5,\"Team\",D15),\"\")","v":""},{"$f":"IFERROR(GETPIVOTDATA(\"Sum of Butler\",Pivots!$K$3,\"Player2\",$C$5,\"Team\",D15),\"\")","v":""},{"$f":"IFERROR(GETPIVOTDATA(\"Sum of Relative\",Pivots!$K$3,\"Player2\",$C$5,\"Team\",D15),\"\")","v":""},null,null,{"$f":"Pivots!AH27","v":16},{"$f":"IFERROR(VLOOKUP(J15,Tables!$F$2:$H$40,2),\"\")","v":"Warks Apr 19"},{"$f":"Pivots!AI28","v":"GW"},{"$f":"IF(J15=0,\"\",GETPIVOTDATA(\"Average of Team\",Pivots!AH15,\"Match\",$J15,\"player2\",$L15))","v":1},{"$f":"IF(J15=0,\"\",GETPIVOTDATA(\"Sum of Butler\",Pivots!AI15,\"Match\",$J15,\"player2\",$L15))","v":-17},{"$f":"IF(J15=0,\"\",GETPIVOTDATA(\"Sum of MatchS\",Pivots!AJ15,\"Match\",$J15,\"player2\",$L15))","v":12},{"$f":"IF(J15=0,\"\",GETPIVOTDATA(\"Sum of Relative\",Pivots!AK15,\"Match\",$J15,\"player2\",$L15))","v":-20},null,null,"BY",1,{"$f":"IFERROR(GETPIVOTDATA(\"Count of Match\",Pivots!B$3,\"Player2\",S15),\"\")","v":""},null,null,null,"JAR",2,5,null,2,"RCM",{"$f":"IF(AG15=\"\",\"\",GETPIVOTDATA(\"Count of Match\",Pivots!$B$3,\"Player2\",$AD15,\"Team\",1)&\"D\")&IF(AH15=\"\",\"\",GETPIVOTDATA(\"Count of Match\",Pivots!$B$3,\"Player2\",$AD15,\"Team\",2)&\"P\")&IF(AI15=\"\",\"\",GETPIVOTDATA(\"Count of Match\",Pivots!$B$3,\"Player2\",$AD15,\"Team\",3)&\"M\")","v":"10D"},{"$f":"IF(AD15=\"\",\"\",GETPIVOTDATA(\"Sum of Relative\",Pivots!$B$3,\"Player2\",$AD15)/GETPIVOTDATA(\"Count of Match\",Pivots!$B$3,\"Player2\",$AD15))","v":10.817250000000001},{"$f":"IFERROR(GETPIVOTDATA(\"Sum of Relative\",Pivots!$B$3,\"Player2\",$AD15,\"Team\",AG$4)/GETPIVOTDATA(\"Count of Match\",Pivots!$B$3,\"Player2\",$AD15,\"Team\",AG$4),\"\")","v":10.817250000000001},{"$f":"IFERROR(GETPIVOTDATA(\"Sum of Relative\",Pivots!$B$3,\"Player2\",$AD15,\"Team\",AH$4)/GETPIVOTDATA(\"Count of Match\",Pivots!$B$3,\"Player2\",$AD15,\"Team\",AH$4),\"\")","v":""},{"$f":"IFERROR(GETPIVOTDATA(\"Sum of Relative\",Pivots!$B$3,\"Player2\",$AD15,\"Team\",AI$4)/GETPIVOTDATA(\"Count of Match\",Pivots!$B$3,\"Player2\",$AD15,\"Team\",AI$4),\"\")","v":""},10.817400000000001,null,9,"RCO",{"$f":"IF(AP15=\"\",\"\",GETPIVOTDATA(\"Count of Match\",Pivots!$B$3,\"Player2\",$AM15,\"Team\",1)&\"D\")&IF(AQ15=\"\",\"\",GETPIVOTDATA(\"Count of Match\",Pivots!$B$3,\"Player2\",$AM15,\"Team\",2)&\"P\")&IF(AR15=\"\",\"\",GETPIVOTDATA(\"Count of Match\",Pivots!$B$3,\"Player2\",$AM15,\"Team\",3)&\"M\")","v":"7P"},{"$f":"IF(AM15=\"\",\"\",GETPIVOTDATA(\"Sum of Relative\",Pivots!$B$3,\"Player2\",$AM15)/GETPIVOTDATA(\"Count of Match\",Pivots!$B$3,\"Player2\",$AM15))","v":-5.9642857142857144},{"$f":"IFERROR(GETPIVOTDATA(\"Sum of Relative\",Pivots!$B$3,\"Player2\",$AM15,\"Team\",AP$4)/GETPIVOTDATA(\"Count of Match\",Pivots!$B$3,\"Player2\",$AM15,\"Team\",AP$4),\"\")","v":""},{"$f":"IFERROR(GETPIVOTDATA(\"Sum of Relative\",Pivots!$B$3,\"Player2\",$AM15,\"Team\",AQ$4)/GETPIVOTDATA(\"Count of Match\",Pivots!$B$3,\"Player2\",$AM15,\"Team\",AQ$4),\"\")","v":-5.9642857142857144},{"$f":"IFERROR(GETPIVOTDATA(\"Sum of Relative\",Pivots!$B$3,\"Player2\",$AM15,\"Team\",AR$4)/GETPIVOTDATA(\"Count of Match\",Pivots!$B$3,\"Player2\",$AM15,\"Team\",AR$4),\"\")","v":""},-5.9641357142857148,null,2,"RHA",{"$f":"IF(AY15=\"\",\"\",GETPIVOTDATA(\"Count of Match\",Pivots!$B$3,\"Player2\",$AV15,\"Team\",1)&\"D\")&IF(AZ15=\"\",\"\",GETPIVOTDATA(\"Count of Match\",Pivots!$B$3,\"Player2\",$AV15,\"Team\",2)&\"P\")&IF(BA15=\"\",\"\",GETPIVOTDATA(\"Count of Match\",Pivots!$B$3,\"Player2\",$AV15,\"Team\",3)&\"M\")","v":"4P5M"},{"$f":"IF(AV15=\"\",\"\",GETPIVOTDATA(\"Sum of Relative\",Pivots!$B$3,\"Player2\",$AV15)/GETPIVOTDATA(\"Count of Match\",Pivots!$B$3,\"Player2\",$AV15))","v":15.403055555555556},{"$f":"IFERROR(GETPIVOTDATA(\"Sum of Relative\",Pivots!$B$3,\"Player2\",$AV15,\"Team\",AY$4)/GETPIVOTDATA(\"Count of Match\",Pivots!$B$3,\"Player2\",$AV15,\"Team\",AY$4),\"\")","v":""},{"$f":"IFERROR(GETPIVOTDATA(\"Sum of Relative\",Pivots!$B$3,\"Player2\",$AV15,\"Team\",AZ$4)/GETPIVOTDATA(\"Count of Match\",Pivots!$B$3,\"Player2\",$AV15,\"Team\",AZ$4),\"\")","v":4.7062499999999998},{"$f":"IFERROR(GETPIVOTDATA(\"Sum of Relative\",Pivots!$B$3,\"Player2\",$AV15,\"Team\",BA$4)/GETPIVOTDATA(\"Count of Match\",Pivots!$B$3,\"Player2\",$AV15,\"Team\",BA$4),\"\")","v":23.960500000000003},23.960650000000005]
[null,null,null,3,{"$f":"IFERROR(GETPIVOTDATA(\"Count of Match\",Pivots!$K$3,\"Player2\",Extract!$C$5,\"Team\",D16),\"\")","v":""},{"$f":"IFERROR(GETPIVOTDATA(\"Sum of Butler\",Pivots!$K3,\"Player2\",$C$5,\"Team\",D16),\"\")","v":""},{"$f":"IFERROR(GETPIVOTDATA(\"Sum of Relative\",Pivots!$K$3,\"Player2\",$C$5,\"Team\",D16),\"\")","v":""},null,null,{"$f":"Pivots!AH29","v":21},{"$f":"IFERROR(VLOOKUP(J16,Tables!$F$2:$H$40,2),\"\")","v":"Worcs Sep 19"},{"$f":"Pivots!AI30","v":"GW"},{"$f":"IF(J16=0,\"\",GETPIVOTDATA(\"Average of Team\",Pivots!AH16,\"Match\",$J16,\"player2\",$L16))","v":1},{"$f":"IF(J16=0,\"\",GETPIVOTDATA(\"Sum of Butler\",Pivots!AI16,\"Match\",$J16,\"player2\",$L16))","v":31},{"$f":"IF(J16=0,\"\",GETPIVOTDATA(\"Sum of MatchS\",Pivots!AJ16,\"Match\",$J16,\"player2\",$L16))","v":191},{"$f":"IF(J16=0,\"\",GETPIVOTDATA(\"Sum of Relative\",Pivots!AK16,\"Match\",$J16,\"player2\",$L16))","v":-16.75},null,null,"CK",1,{"$f":"IFERROR(GETPIVOTDATA(\"Count of Match\",Pivots!B$3,\"Player2\",S16),\"\")","v":""},null,null,null,"JAT",1,4,null,6,"RPL",{"$f":"IF(AG16=\"\",\"\",GETPIVOTDATA(\"Count of Match\",Pivots!$B$3,\"Player2\",$AD16,\"Team\",1)&\"D\")&IF(AH16=\"\",\"\",GETPIVOTDATA(\"Count of Match\",Pivots!$B$3,\"Player2\",$AD16,\"Team\",2)&\"P\")&IF(AI16=\"\",\"\",GETPIVOTDATA(\"Count of Match\",Pivots!$B$3,\"Player2\",$AD16,\"Team\",3)&\"M\")","v":"11D"},{"$f":"IF(AD16=\"\",\"\",GETPIVOTDATA(\"Sum of Relative\",Pivots!$B$3,\"Player2\",$AD16)/GETPIVOTDATA(\"Count of Match\",Pivots!$B$3,\"Player2\",$AD16))","v":5.7856818181818177},{"$f":"IFERROR(GETPIVOTDATA(\"Sum of Relative\",Pivots!$B$3,\"Player2\",$AD16,\"Team\",AG$4)/GETPIVOTDATA(\"Count of Match\",Pivots!$B$3,\"Player2\",$AD16,\"Team\",AG$4),\"\")","v":5.7856818181818177},{"$f":"IFERROR(GETPIVOTDATA(\"Sum of Relative\",Pivots!$B$3,\"Player2\",$AD16,\"Team\",AH$4)/GETPIVOTDATA(\"Count of Match\",Pivots!$B$3,\"Player2\",$AD16,\"Team\",AH$4),\"\")","v":""},{"$f":"IFERROR(GETPIVOTDATA(\"Sum of Relative\",Pivots!$B$3,\"Player2\",$AD16,\"Team\",AI$4)/GETPIVOTDATA(\"Count of Match\",Pivots!$B$3,\"Player2\",$AD16,\"Team\",AI$4),\"\")","v":""},5.7858418181818179,null,7,"VC",{"$f":"IF(AP16=\"\",\"\",GETPIVOTDATA(\"Count of Match\",Pivots!$B$3,\"Player2\",$AM16,\"Team\",1)&\"D\")&IF(AQ16=\"\",\"\",GETPIVOTDATA(\"Count of Match\",Pivots!$B$3,\"Player2\",$AM16,\"Team\",2)&\"P\")&IF(AR16=\"\",\"\",GETPIVOTDATA(\"Count of Match\",Pivots!$B$3,\"Player2\",$AM16,\"Team\",3)&\"M\")","v":"2P4M"},{"$f":"IF(AM16=\"\",\"\",GETPIVOTDATA(\"Sum of Relative\",Pivots!$B$3,\"Player2\",$AM16)/GETPIVOTDATA(\"Count of Match\",Pivots!$B$3,\"Player2\",$AM16))","v":0.74625000000000108},{"$f":"IFERROR(GETPIVOTDATA(\"Sum of Relative\",Pivots!$B$3,\"Player2\",$AM16,\"Team\",AP$4)/GETPIVOTDATA(\"Count of Match\",Pivots!$B$3,\"Player2\",$AM16,\"Team\",AP$4),\"\")","v":""},{"$f":"IFERROR(GETPIVOTDATA(\"Sum of Relative\",Pivots!$B$3,\"Player2\",$AM16,\"Team\",AQ$4)/GETPIVOTDATA(\"Count of Match\",Pivots!$B$3,\"Player2\",$AM16,\"Team\",AQ$4),\"\")","v":-2.375},{"$f":"IFERROR(GETPIVOTDATA(\"Sum of Relative\",Pivots!$B$3,\"Player2\",$AM16,\"Team\",AR$4)/GETPIVOTDATA(\"Count of Match\",Pivots!$B$3,\"Player2\",$AM16,\"Team\",AR$4),\"\")","v":2.3068750000000016},-2.3748399999999998,null,6,"RJ",{"$f":"IF(AY16=\"\",\"\",GETPIVOTDATA(\"Count of Match\",Pivots!$B$3,\"Player2\",$AV16,\"Team\",1)&\"D\")&IF(AZ16=\"\",\"\",GETPIVOTDATA(\"Count of Match\",Pivots!$B$3,\"Player2\",$AV16,\"Team\",2)&\"P\")&IF(BA16=\"\",\"\",GETPIVOTDATA(\"Count of Match\",Pivots!$B$3,\"Player2\",$AV16,\"Team\",3)&\"M\")","v":"11M"},{"$f":"IF(AV16=\"\",\"\",GETPIVOTDATA(\"Sum of Relative\",Pivots!$B$3,\"Player2\",$AV16)/GETPIVOTDATA(\"Count of Match\",Pivots!$B$3,\"Player2\",$AV16))","v":0.38272727272727347},{"$f":"IFERROR(GETPIVOTDATA(\"Sum of Relative\",Pivots!$B$3,\"Player2\",$AV16,\"Team\",AY$4)/GETPIVOTDATA(\"Count of Match\",Pivots!$B$3,\"Player2\",$AV16,\"Team\",AY$4),\"\")","v":""},{"$f":"IFERROR(GETPIVOTDATA(\"Sum of Relative\",Pivots!$B$3,\"Player2\",$AV16,\"Team\",AZ$4)/GETPIVOTDATA(\"Count of Match\",Pivots!$B$3,\"Player2\",$AV16,\"Team\",AZ$4),\"\")","v":""},{"$f":"IFERROR(GETPIVOTDATA(\"Sum of Relative\",Pivots!$B$3,\"Player2\",$AV16,\"Team\",BA$4)/GETPIVOTDATA(\"Count of Match\",Pivots!$B$3,\"Player2\",$AV16,\"Team\",BA$4),\"\")","v":0.38272727272727347},0.38288727272727346]
[null,null,null,null,null,null,null,null,null,{"$f":"Pivots!AH31","v":22},{"$f":"IFERROR(VLOOKUP(J17,Tables!$F$2:$H$40,2),\"\")","v":"Oxford Oct 19"},{"$f":"Pivots!AI32","v":"KST"},{"$f":"IF(J17=0,\"\",GETPIVOTDATA(\"Average of Team\",Pivots!AH17,\"Match\",$J17,\"player2\",$L17))","v":1},{"$f":"IF(J17=0,\"\",GETPIVOTDATA(\"Sum of Butler\",Pivots!AI17,\"Match\",$J17,\"player2\",$L17))","v":22},{"$f":"IF(J17=0,\"\",GETPIVOTDATA(\"Sum of MatchS\",Pivots!AJ17,\"Match\",$J17,\"player2\",$L17))","v":1},{"$f":"IF(J17=0,\"\",GETPIVOTDATA(\"Sum of Relative\",Pivots!AK17,\"Match\",$J17,\"player2\",$L17))","v":21.75},null,null,"CL",3,{"$f":"IFERROR(GETPIVOTDATA(\"Count of Match\",Pivots!B$3,\"Player2\",S17),\"\")","v":""},null,null,null,"JC",2,9,null,12,"TH",{"$f":"IF(AG17=\"\",\"\",GETPIVOTDATA(\"Count of Match\",Pivots!$B$3,\"Player2\",$AD17,\"Team\",1)&\"D\")&IF(AH17=\"\",\"\",GETPIVOTDATA(\"Count of Match\",Pivots!$B$3,\"Player2\",$AD17,\"Team\",2)&\"P\")&IF(AI17=\"\",\"\",GETPIVOTDATA(\"Count of Match\",Pivots!$B$3,\"Player2\",$AD17,\"Team\",3)&\"M\")","v":"2D1P"},{"$f":"IF(AD17=\"\",\"\",GETPIVOTDATA(\"Sum of Relative\",Pivots!$B$3,\"Player2\",$AD17)/GETPIVOTDATA(\"Count of Match\",Pivots!$B$3,\"Player2\",$AD17))","v":-25.166666666666668},{"$f":"IFERROR(GETPIVOTDATA(\"Sum of Relative\",Pivots!$B$3,\"Player2\",$AD17,\"Team\",AG$4)/GETPIVOTDATA(\"Count of Match\",Pivots!$B$3,\"Player2\",$AD17,\"Team\",AG$4),\"\")","v":-23.875},{"$f":"IFERROR(GETPIVOTDATA(\"Sum of Relative\",Pivots!$B$3,\"Player2\",$AD17,\"Team\",AH$4)/GETPIVOTDATA(\"Count of Match\",Pivots!$B$3,\"Player2\",$AD17,\"Team\",AH$4),\"\")","v":-27.75},{"$f":"IFERROR(GETPIVOTDATA(\"Sum of Relative\",Pivots!$B$3,\"Player2\",$AD17,\"Team\",AI$4)/GETPIVOTDATA(\"Count of Match\",Pivots!$B$3,\"Player2\",$AD17,\"Team\",AI$4),\"\")","v":""},-23.874829999999999,null,11,"WA",{"$f":"IF(AP17=\"\",\"\",GETPIVOTDATA(\"Count of Match\",Pivots!$B$3,\"Player2\",$AM17,\"Team\",1)&\"D\")&IF(AQ17=\"\",\"\",GETPIVOTDATA(\"Count of Match\",Pivots!$B$3,\"Player2\",$AM17,\"Team\",2)&\"P\")&IF(AR17=\"\",\"\",GETPIVOTDATA(\"Count of Match\",Pivots!$B$3,\"Player2\",$AM17,\"Team\",3)&\"M\")","v":"1D3P1M"},{"$f":"IF(AM17=\"\",\"\",GETPIVOTDATA(\"Sum of Relative\",Pivots!$B$3,\"Player2\",$AM17)/GETPIVOTDATA(\"Count of Match\",Pivots!$B$3,\"Player2\",$AM17))","v":-17.7075},{"$f":"IFERROR(GETPIVOTDATA(\"Sum of Relative\",Pivots!$B$3,\"Player2\",$AM17,\"Team\",AP$4)/GETPIVOTDATA(\"Count of Match\",Pivots!$B$3,\"Player2\",$AM17,\"Team\",AP$4),\"\")","v":-39.25},{"$f":"IFERROR(GETPIVOTDATA(\"Sum of Relative\",Pivots!$B$3,\"Player2\",$AM17,\"Team\",AQ$4)/GETPIVOTDATA(\"Count of Match\",Pivots!$B$3,\"Player2\",$AM17,\"Team\",AQ$4),\"\")","v":-16.429166666666664},{"$f":"IFERROR(GETPIVOTDATA(\"Sum of Relative\",Pivots!$B$3,\"Player2\",$AM17,\"Team\",AR$4)/GETPIVOTDATA(\"Count of Match\",Pivots!$B$3,\"Player2\",$AM17,\"Team\",AR$4),\"\")","v":0},-16.428996666666663,null,4,"RS",{"$f":"IF(AY17=\"\",\"\",GETPIVOTDATA(\"Count of Match\",Pivots!$B$3,\"Player2\",$AV17,\"Team\",1)&\"D\")&IF(AZ17=\"\",\"\",GETPIVOTDATA(\"Count of Match\",Pivots!$B$3,\"Player2\",$AV17,\"Team\",2)&\"P\")&IF(BA17=\"\",\"\",GETPIVOTDATA(\"Count of Match\",Pivots!$B$3,\"Player2\",$AV17,\"Team\",3)&\"M\")","v":"4P5M"},{"$f":"IF(AV17=\"\",\"\",GETPIVOTDATA(\"Sum of Relative\",Pivots!$B$3,\"Player2\",$AV17)/GETPIVOTDATA(\"Count of Match\",Pivots!$B$3,\"Player2\",$AV17))","v":8.8224999999999998},{"$f":"IFERROR(GETPIVOTDATA(\"Sum of Relative\",Pivots!$B$3,\"Player2\",$AV17,\"Team\",AY$4)/GETPIVOTDATA(\"Count of Match\",Pivots!$B$3,\"Player2\",$AV17,\"Team\",AY$4),\"\")","v":""},{"$f":"IFERROR(GETPIVOTDATA(\"Sum of Relative\",Pivots!$B$3,\"Player2\",$AV17,\"Team\",AZ$4)/GETPIVOTDATA(\"Count of Match\",Pivots!$B$3,\"Player2\",$AV17,\"Team\",AZ$4),\"\")","v":4.5},{"$f":"IFERROR(GETPIVOTDATA(\"Sum of Relative\",Pivots!$B$3,\"Player2\",$AV17,\"Team\",BA$4)/GETPIVOTDATA(\"Count of Match\",Pivots!$B$3,\"Player2\",$AV17,\"Team\",BA$4),\"\")","v":12.2805},12.280670000000001]
[null,null,null,"Total",{"$f":"SUM(E14:E16)","v":5},{"$f":"SUM(F14:F16)","v":73.180000000000007},{"$f":"SUM(G14:G16)","v":-7.9699999999999989},null,null,{"$f":"Pivots!AH33","v":23},{"$f":"IFERROR(VLOOKUP(J18,Tables!$F$2:$H$40,2),\"\")","v":"Derby Nov 19"},{"$f":"Pivots!AI34","v":"AKM"},{"$f":"IF(J18=0,\"\",GETPIVOTDATA(\"Average of Team\",Pivots!AH18,\"Match\",$J18,\"player2\",$L18))","v":1},{"$f":"IF(J18=0,\"\",GETPIVOTDATA(\"Sum of Butler\",Pivots!AI18,\"Match\",$J18,\"player2\",$L18))","v":-10},{"$f":"IF(J18=0,\"\",GETPIVOTDATA(\"Sum of MatchS\",Pivots!AJ18,\"Match\",$J18,\"player2\",$L18))","v":46},{"$f":"IF(J18=0,\"\",GETPIVOTDATA(\"Sum of Relative\",Pivots!AK18,\"Match\",$J18,\"player2\",$L18))","v":-21.5},null,null,"CM",3,{"$f":"IFERROR(GETPIVOTDATA(\"Count of Match\",Pivots!B$3,\"Player2\",S18),\"\")","v":""},null,null,null,"JSI",2,12,null,"",null,{"$f":"IF(AG18=\"\",\"\",GETPIVOTDATA(\"Count of Match\",Pivots!$B$3,\"Player2\",$AD18,\"Team\",1)&\"D\")&IF(AH18=\"\",\"\",GETPIVOTDATA(\"Count of Match\",Pivots!$B$3,\"Player2\",$AD18,\"Team\",2)&\"P\")&IF(AI18=\"\",\"\",GETPIVOTDATA(\"Count of Match\",Pivots!$B$3,\"Player2\",$AD18,\"Team\",3)&\"M\")","v":""},{"$f":"IF(AD18=\"\",\"\",GETPIVOTDATA(\"Sum of Relative\",Pivots!$B$3,\"Player2\",$AD18)/GETPIVOTDATA(\"Count of Match\",Pivots!$B$3,\"Player2\",$AD18))","v":""},{"$f":"IFERROR(GETPIVOTDATA(\"Sum of Relative\",Pivots!$B$3,\"Player2\",$AD18,\"Team\",AG$4)/GETPIVOTDATA(\"Count of Match\",Pivots!$B$3,\"Player2\",$AD18,\"Team\",AG$4),\"\")","v":""},{"$f":"IFERROR(GETPIVOTDATA(\"Sum of Relative\",Pivots!$B$3,\"Player2\",$AD18,\"Team\",AH$4)/GETPIVOTDATA(\"Count of Match\",Pivots!$B$3,\"Player2\",$AD18,\"Team\",AH$4),\"\")","v":""},{"$f":"IFERROR(GETPIVOTDATA(\"Sum of Relative\",Pivots!$B$3,\"Player2\",$AD18,\"Team\",AI$4)/GETPIVOTDATA(\"Count of Match\",Pivots!$B$3,\"Player2\",$AD18,\"Team\",AI$4),\"\")","v":""},"",null,"",null,{"$f":"IF(AP18=\"\",\"\",GETPIVOTDATA(\"Count of Match\",Pivots!$B$3,\"Player2\",$AM18,\"Team\",1)&\"D\")&IF(AQ18=\"\",\"\",GETPIVOTDATA(\"Count of Match\",Pivots!$B$3,\"Player2\",$AM18,\"Team\",2)&\"P\")&IF(AR18=\"\",\"\",GETPIVOTDATA(\"Count of Match\",Pivots!$B$3,\"Player2\",$AM18,\"Team\",3)&\"M\")","v":""},{"$f":"IF(AM18=\"\",\"\",GETPIVOTDATA(\"Sum of Relative\",Pivots!$B$3,\"Player2\",$AM18)/GETPIVOTDATA(\"Count of Match\",Pivots!$B$3,\"Player2\",$AM18))","v":""},{"$f":"IFERROR(GETPIVOTDATA(\"Sum of Relative\",Pivots!$B$3,\"Player2\",$AM18,\"Team\",AP$4)/GETPIVOTDATA(\"Count of Match\",Pivots!$B$3,\"Player2\",$AM18,\"Team\",AP$4),\"\")","v":""},{"$f":"IFERROR(GETPIVOTDATA(\"Sum of Relative\",Pivots!$B$3,\"Player2\",$AM18,\"Team\",AQ$4)/GETPIVOTDATA(\"Count of Match\",Pivots!$B$3,\"Player2\",$AM18,\"Team\",AQ$4),\"\")","v":""},{"$f":"IFERROR(GETPIVOTDATA(\"Sum of Relative\",Pivots!$B$3,\"Player2\",$AM18,\"Team\",AR$4)/GETPIVOTDATA(\"Count of Match\",Pivots!$B$3,\"Player2\",$AM18,\"Team\",AR$4),\"\")","v":""},"",null,11,"RW",{"$f":"IF(AY18=\"\",\"\",GETPIVOTDATA(\"Count of Match\",Pivots!$B$3,\"Player2\",$AV18,\"Team\",1)&\"D\")&IF(AZ18=\"\",\"\",GETPIVOTDATA(\"Count of Match\",Pivots!$B$3,\"Player2\",$AV18,\"Team\",2)&\"P\")&IF(BA18=\"\",\"\",GETPIVOTDATA(\"Count of Match\",Pivots!$B$3,\"Player2\",$AV18,\"Team\",3)&\"M\")","v":"3M"},{"$f":"IF(AV18=\"\",\"\",GETPIVOTDATA(\"Sum of Relative\",Pivots!$B$3,\"Player2\",$AV18)/GETPIVOTDATA(\"Count of Match\",Pivots!$B$3,\"Player2\",$AV18))","v":-11.939166666666665},{"$f":"IFERROR(GETPIVOTDATA(\"Sum of Relative\",Pivots!$B$3,\"Player2\",$AV18,\"Team\",AY$4)/GETPIVOTDATA(\"Count of Match\",Pivots!$B$3,\"Player2\",$AV18,\"Team\",AY$4),\"\")","v":""},{"$f":"IFERROR(GETPIVOTDATA(\"Sum of Relative\",Pivots!$B$3,\"Player2\",$AV18,\"Team\",AZ$4)/GETPIVOTDATA(\"Count of Match\",Pivots!$B$3,\"Player2\",$AV18,\"Team\",AZ$4),\"\")","v":""},{"$f":"IFERROR(GETPIVOTDATA(\"Sum of Relative\",Pivots!$B$3,\"Player2\",$AV18,\"Team\",BA$4)/GETPIVOTDATA(\"Count of Match\",Pivots!$B$3,\"Player2\",$AV18,\"Team\",BA$4),\"\")","v":-11.939166666666665},-11.938986666666665]
[null,null,null,null,null,null,null,null,null,{"$f":"Pivots!AH35","v":24},{"$f":"IFERROR(VLOOKUP(J19,Tables!$F$2:$H$40,2),\"\")","v":"Notts Dec 19"},{"$f":"Pivots!AI36","v":"GW"},{"$f":"IF(J19=0,\"\",GETPIVOTDATA(\"Average of Team\",Pivots!AH19,\"Match\",$J19,\"player2\",$L19))","v":1},{"$f":"IF(J19=0,\"\",GETPIVOTDATA(\"Sum of Butler\",Pivots!AI19,\"Match\",$J19,\"player2\",$L19))","v":26},{"$f":"IF(J19=0,\"\",GETPIVOTDATA(\"Sum of MatchS\",Pivots!AJ19,\"Match\",$J19,\"player2\",$L19))","v":-3},{"$f":"IF(J19=0,\"\",GETPIVOTDATA(\"Sum of Relative\",Pivots!AK19,\"Match\",$J19,\"player2\",$L19))","v":26.75},null,null,"CRO",1,{"$f":"IFERROR(GETPIVOTDATA(\"Count of Match\",Pivots!B$3,\"Player2\",S19),\"\")","v":4},null,null,null,"JuS",3,4,null,"",null,{"$f":"IF(AG19=\"\",\"\",GETPIVOTDATA(\"Count of Match\",Pivots!$B$3,\"Player2\",$AD19,\"Team\",1)&\"D\")&IF(AH19=\"\",\"\",GETPIVOTDATA(\"Count of Match\",Pivots!$B$3,\"Player2\",$AD19,\"Team\",2)&\"P\")&IF(AI19=\"\",\"\",GETPIVOTDATA(\"Count of Match\",Pivots!$B$3,\"Player2\",$AD19,\"Team\",3)&\"M\")","v":""},{"$f":"IF(AD19=\"\",\"\",GETPIVOTDATA(\"Sum of Relative\",Pivots!$B$3,\"Player2\",$AD19)/GETPIVOTDATA(\"Count of Match\",Pivots!$B$3,\"Player2\",$AD19))","v":""},{"$f":"IFERROR(GETPIVOTDATA(\"Sum of Relative\",Pivots!$B$3,\"Player2\",$AD19,\"Team\",AG$4)/GETPIVOTDATA(\"Count of Match\",Pivots!$B$3,\"Player2\",$AD19,\"Team\",AG$4),\"\")","v":""},{"$f":"IFERROR(GETPIVOTDATA(\"Sum of Relative\",Pivots!$B$3,\"Player2\",$AD19,\"Team\",AH$4)/GETPIVOTDATA(\"Count of Match\",Pivots!$B$3,\"Player2\",$AD19,\"Team\",AH$4),\"\")","v":""},{"$f":"IFERROR(GETPIVOTDATA(\"Sum of Relative\",Pivots!$B$3,\"Player2\",$AD19,\"Team\",AI$4)/GETPIVOTDATA(\"Count of Match\",Pivots!$B$3,\"Player2\",$AD19,\"Team\",AI$4),\"\")","v":""},"",null,"",null,{"$f":"IF(AP19=\"\",\"\",GETPIVOTDATA(\"Count of Match\",Pivots!$B$3,\"Player2\",$AM19,\"Team\",1)&\"D\")&IF(AQ19=\"\",\"\",GETPIVOTDATA(\"Count of Match\",Pivots!$B$3,\"Player2\",$AM19,\"Team\",2)&\"P\")&IF(AR19=\"\",\"\",GETPIVOTDATA(\"Count of Match\",Pivots!$B$3,\"Player2\",$AM19,\"Team\",3)&\"M\")","v":""},{"$f":"IF(AM19=\"\",\"\",GETPIVOTDATA(\"Sum of Relative\",Pivots!$B$3,\"Player2\",$AM19)/GETPIVOTDATA(\"Count of Match\",Pivots!$B$3,\"Player2\",$AM19))","v":""},{"$f":"IFERROR(GETPIVOTDATA(\"Sum of Relative\",Pivots!$B$3,\"Player2\",$AM19,\"Team\",AP$4)/GETPIVOTDATA(\"Count of Match\",Pivots!$B$3,\"Player2\",$AM19,\"Team\",AP$4),\"\")","v":""},{"$f":"IFERROR(GETPIVOTDATA(\"Sum of Relative\",Pivots!$B$3,\"Player2\",$AM19,\"Team\",AQ$4)/GETPIVOTDATA(\"Count of Match\",Pivots!$B$3,\"Player2\",$AM19,\"Team\",AQ$4),\"\")","v":""},{"$f":"IFERROR(GETPIVOTDATA(\"Sum of Relative\",Pivots!$B$3,\"Player2\",$AM19,\"Team\",AR$4)/GETPIVOTDATA(\"Count of Match\",Pivots!$B$3,\"Player2\",$AM19,\"Team\",AR$4),\"\")","v":""},"",null,5,"TG",{"$f":"IF(AY19=\"\",\"\",GETPIVOTDATA(\"Count of Match\",Pivots!$B$3,\"Player2\",$AV19,\"Team\",1)&\"D\")&IF(AZ19=\"\",\"\",GETPIVOTDATA(\"Count of Match\",Pivots!$B$3,\"Player2\",$AV19,\"Team\",2)&\"P\")&IF(BA19=\"\",\"\",GETPIVOTDATA(\"Count of Match\",Pivots!$B$3,\"Player2\",$AV19,\"Team\",3)&\"M\")","v":"2P2M"},{"$f":"IF(AV19=\"\",\"\",GETPIVOTDATA(\"Sum of Relative\",Pivots!$B$3,\"Player2\",$AV19)/GETPIVOTDATA(\"Count of Match\",Pivots!$B$3,\"Player2\",$AV19))","v":6.8881250000000005},{"$f":"IFERROR(GETPIVOTDATA(\"Sum of Relative\",Pivots!$B$3,\"Player2\",$AV19,\"Team\",AY$4)/GETPIVOTDATA(\"Count of Match\",Pivots!$B$3,\"Player2\",$AV19,\"Team\",AY$4),\"\")","v":""},{"$f":"IFERROR(GETPIVOTDATA(\"Sum of Relative\",Pivots!$B$3,\"Player2\",$AV19,\"Team\",AZ$4)/GETPIVOTDATA(\"Count of Match\",Pivots!$B$3,\"Player2\",$AV19,\"Team\",AZ$4),\"\")","v":5.875},{"$f":"IFERROR(GETPIVOTDATA(\"Sum of Relative\",Pivots!$B$3,\"Player2\",$AV19,\"Team\",BA$4)/GETPIVOTDATA(\"Count of Match\",Pivots!$B$3,\"Player2\",$AV19,\"Team\",BA$4),\"\")","v":7.901250000000001},7.9014400000000009]
[null,null,null,null,null,null,null,null,null,{"$f":"Pivots!AH37","v":26},{"$f":"IFERROR(VLOOKUP(J20,Tables!$F$2:$H$40,2),\"\")","v":"Warks Feb 20"},{"$f":"Pivots!AI38","v":"GW"},{"$f":"IF(J20=0,\"\",GETPIVOTDATA(\"Average of Team\",Pivots!AH20,\"Match\",$J20,\"player2\",$L20))","v":1},{"$f":"IF(J20=0,\"\",GETPIVOTDATA(\"Sum of Butler\",Pivots!AI20,\"Match\",$J20,\"player2\",$L20))","v":4.18},{"$f":"IF(J20=0,\"\",GETPIVOTDATA(\"Sum of MatchS\",Pivots!AJ20,\"Match\",$J20,\"player2\",$L20))","v":89.6},{"$f":"IF(J20=0,\"\",GETPIVOTDATA(\"Sum of Relative\",Pivots!AK20,\"Match\",$J20,\"player2\",$L20))","v":-18.22},null,null,"DA",3,{"$f":"IFERROR(GETPIVOTDATA(\"Count of Match\",Pivots!B$3,\"Player2\",S20),\"\")","v":4},null,null,null,"KAS",3,2,null,"",null,{"$f":"IF(AG20=\"\",\"\",GETPIVOTDATA(\"Count of Match\",Pivots!$B$3,\"Player2\",$AD20,\"Team\",1)&\"D\")&IF(AH20=\"\",\"\",GETPIVOTDATA(\"Count of Match\",Pivots!$B$3,\"Player2\",$AD20,\"Team\",2)&\"P\")&IF(AI20=\"\",\"\",GETPIVOTDATA(\"Count of Match\",Pivots!$B$3,\"Player2\",$AD20,\"Team\",3)&\"M\")","v":""},{"$f":"IF(AD20=\"\",\"\",GETPIVOTDATA(\"Sum of Relative\",Pivots!$B$3,\"Player2\",$AD20)/GETPIVOTDATA(\"Count of Match\",Pivots!$B$3,\"Player2\",$AD20))","v":""},{"$f":"IFERROR(GETPIVOTDATA(\"Sum of Relative\",Pivots!$B$3,\"Player2\",$AD20,\"Team\",AG$4)/GETPIVOTDATA(\"Count of Match\",Pivots!$B$3,\"Player2\",$AD20,\"Team\",AG$4),\"\")","v":""},{"$f":"IFERROR(GETPIVOTDATA(\"Sum of Relative\",Pivots!$B$3,\"Player2\",$AD20,\"Team\",AH$4)/GETPIVOTDATA(\"Count of Match\",Pivots!$B$3,\"Player2\",$AD20,\"Team\",AH$4),\"\")","v":""},{"$f":"IFERROR(GETPIVOTDATA(\"Sum of Relative\",Pivots!$B$3,\"Player2\",$AD20,\"Team\",AI$4)/GETPIVOTDATA(\"Count of Match\",Pivots!$B$3,\"Player2\",$AD20,\"Team\",AI$4),\"\")","v":""},"",null,"",null,{"$f":"IF(AP20=\"\",\"\",GETPIVOTDATA(\"Count of Match\",Pivots!$B$3,\"Player2\",$AM20,\"Team\",1)&\"D\")&IF(AQ20=\"\",\"\",GETPIVOTDATA(\"Count of Match\",Pivots!$B$3,\"Player2\",$AM20,\"Team\",2)&\"P\")&IF(AR20=\"\",\"\",GETPIVOTDATA(\"Count of Match\",Pivots!$B$3,\"Player2\",$AM20,\"Team\",3)&\"M\")","v":""},{"$f":"IF(AM20=\"\",\"\",GETPIVOTDATA(\"Sum of Relative\",Pivots!$B$3,\"Player2\",$AM20)/GETPIVOTDATA(\"Count of Match\",Pivots!$B$3,\"Player2\",$AM20))","v":""},{"$f":"IFERROR(GETPIVOTDATA(\"Sum of Relative\",Pivots!$B$3,\"Player2\",$AM20,\"Team\",AP$4)/GETPIVOTDATA(\"Count of Match\",Pivots!$B$3,\"Player2\",$AM20,\"Team\",AP$4),\"\")","v":""},{"$f":"IFERROR(GETPIVOTDATA(\"Sum of Relative\",Pivots!$B$3,\"Player2\",$AM20,\"Team\",AQ$4)/GETPIVOTDATA(\"Count of Match\",Pivots!$B$3,\"Player2\",$AM20,\"Team\",AQ$4),\"\")","v":""},{"$f":"IFERROR(GETPIVOTDATA(\"Sum of Relative\",Pivots!$B$3,\"Player2\",$AM20,\"Team\",AR$4)/GETPIVOTDATA(\"Count of Match\",Pivots!$B$3,\"Player2\",$AM20,\"Team\",AR$4),\"\")","v":""},"",null,3,"TL",{"$f":"IF(AY20=\"\",\"\",GETPIVOTDATA(\"Count of Match\",Pivots!$B$3,\"Player2\",$AV20,\"Team\",1)&\"D\")&IF(AZ20=\"\",\"\",GETPIVOTDATA(\"Count of Match\",Pivots!$B$3,\"Player2\",$AV20,\"Team\",2)&\"P\")&IF(BA20=\"\",\"\",GETPIVOTDATA(\"Count of Match\",Pivots!$B$3,\"Player2\",$AV20,\"Team\",3)&\"M\")","v":"4P5M"},{"$f":"IF(AV20=\"\",\"\",GETPIVOTDATA(\"Sum of Relative\",Pivots!$B$3,\"Player2\",$AV20)/GETPIVOTDATA(\"Count of Match\",Pivots!$B$3,\"Player2\",$AV20))","v":8.8224999999999998},{"$f":"IFERROR(GETPIVOTDATA(\"Sum of Relative\",Pivots!$B$3,\"Player2\",$AV20,\"Team\",AY$4)/GETPIVOTDATA(\"Count of Match\",Pivots!$B$3,\"Player2\",$AV20,\"Team\",AY$4),\"\")","v":""},{"$f":"IFERROR(GETPIVOTDATA(\"Sum of Relative\",Pivots!$B$3,\"Player2\",$AV20,\"Team\",AZ$4)/GETPIVOTDATA(\"Count of Match\",Pivots!$B$3,\"Player2\",$AV20,\"Team\",AZ$4),\"\")","v":4.5},{"$f":"IFERROR(GETPIVOTDATA(\"Sum of Relative\",Pivots!$B$3,\"Player2\",$AV20,\"Team\",BA$4)/GETPIVOTDATA(\"Count of Match\",Pivots!$B$3,\"Player2\",$AV20,\"Team\",BA$4),\"\")","v":12.2805},12.2807]
[null,null,null,null,null,null,null,null,null,{"$f":"Pivots!AH39","v":0},{"$f":"IFERROR(VLOOKUP(J21,Tables!$F$2:$H$40,2),\"\")","v":""},{"$f":"Pivots!AI40","v":0},{"$f":"IF(J21=0,\"\",GETPIVOTDATA(\"Average of Team\",Pivots!AH21,\"Match\",$J21,\"player2\",$L21))","v":""},{"$f":"IF(J21=0,\"\",GETPIVOTDATA(\"Sum of Butler\",Pivots!AI21,\"Match\",$J21,\"player2\",$L21))","v":""},{"$f":"IF(J21=0,\"\",GETPIVOTDATA(\"Sum of MatchS\",Pivots!AJ21,\"Match\",$J21,\"player2\",$L21))","v":""},{"$f":"IF(J21=0,\"\",GETPIVOTDATA(\"Sum of Relative\",Pivots!AK21,\"Match\",$J21,\"player2\",$L21))","v":""},null,null,"DHA",3,{"$f":"IFERROR(GETPIVOTDATA(\"Count of Match\",Pivots!B$3,\"Player2\",S21),\"\")","v":""},null,null,null,"KST",1,8,null,"",null,{"$f":"IF(AG21=\"\",\"\",GETPIVOTDATA(\"Count of Match\",Pivots!$B$3,\"Player2\",$AD21,\"Team\",1)&\"D\")&IF(AH21=\"\",\"\",GETPIVOTDATA(\"Count of Match\",Pivots!$B$3,\"Player2\",$AD21,\"Team\",2)&\"P\")&IF(AI21=\"\",\"\",GETPIVOTDATA(\"Count of Match\",Pivots!$B$3,\"Player2\",$AD21,\"Team\",3)&\"M\")","v":""},{"$f":"IF(AD21=\"\",\"\",GETPIVOTDATA(\"Sum of Relative\",Pivots!$B$3,\"Player2\",$AD21)/GETPIVOTDATA(\"Count of Match\",Pivots!$B$3,\"Player2\",$AD21))","v":""},{"$f":"IFERROR(GETPIVOTDATA(\"Sum of Relative\",Pivots!$B$3,\"Player2\",$AD21,\"Team\",AG$4)/GETPIVOTDATA(\"Count of Match\",Pivots!$B$3,\"Player2\",$AD21,\"Team\",AG$4),\"\")","v":""},{"$f":"IFERROR(GETPIVOTDATA(\"Sum of Relative\",Pivots!$B$3,\"Player2\",$AD21,\"Team\",AH$4)/GETPIVOTDATA(\"Count of Match\",Pivots!$B$3,\"Player2\",$AD21,\"Team\",AH$4),\"\")","v":""},{"$f":"IFERROR(GETPIVOTDATA(\"Sum of Relative\",Pivots!$B$3,\"Player2\",$AD21,\"Team\",AI$4)/GETPIVOTDATA(\"Count of Match\",Pivots!$B$3,\"Player2\",$AD21,\"Team\",AI$4),\"\")","v":""},"",null,"",null,{"$f":"IF(AP21=\"\",\"\",GETPIVOTDATA(\"Count of Match\",Pivots!$B$3,\"Player2\",$AM21,\"Team\",1)&\"D\")&IF(AQ21=\"\",\"\",GETPIVOTDATA(\"Count of Match\",Pivots!$B$3,\"Player2\",$AM21,\"Team\",2)&\"P\")&IF(AR21=\"\",\"\",GETPIVOTDATA(\"Count of Match\",Pivots!$B$3,\"Player2\",$AM21,\"Team\",3)&\"M\")","v":""},{"$f":"IF(AM21=\"\",\"\",GETPIVOTDATA(\"Sum of Relative\",Pivots!$B$3,\"Player2\",$AM21)/GETPIVOTDATA(\"Count of Match\",Pivots!$B$3,\"Player2\",$AM21))","v":""},{"$f":"IFERROR(GETPIVOTDATA(\"Sum of Relative\",Pivots!$B$3,\"Player2\",$AM21,\"Team\",AP$4)/GETPIVOTDATA(\"Count of Match\",Pivots!$B$3,\"Player2\",$AM21,\"Team\",AP$4),\"\")","v":""},{"$f":"IFERROR(GETPIVOTDATA(\"Sum of Relative\",Pivots!$B$3,\"Player2\",$AM21,\"Team\",AQ$4)/GETPIVOTDATA(\"Count of Match\",Pivots!$B$3,\"Player2\",$AM21,\"Team\",AQ$4),\"\")","v":""},{"$f":"IFERROR(GETPIVOTDATA(\"Sum of Relative\",Pivots!$B$3,\"Player2\",$AM21,\"Team\",AR$4)/GETPIVOTDATA(\"Count of Match\",Pivots!$B$3,\"Player2\",$AM21,\"Team\",AR$4),\"\")","v":""},"",null,"",null,{"$f":"IF(AY21=\"\",\"\",GETPIVOTDATA(\"Count of Match\",Pivots!$B$3,\"Player2\",$AV21,\"Team\",1)&\"D\")&IF(AZ21=\"\",\"\",GETPIVOTDATA(\"Count of Match\",Pivots!$B$3,\"Player2\",$AV21,\"Team\",2)&\"P\")&IF(BA21=\"\",\"\",GETPIVOTDATA(\"Count of Match\",Pivots!$B$3,\"Player2\",$AV21,\"Team\",3)&\"M\")","v":""},{"$f":"IF(AV21=\"\",\"\",GETPIVOTDATA(\"Sum of Relative\",Pivots!$B$3,\"Player2\",$AV21)/GETPIVOTDATA(\"Count of Match\",Pivots!$B$3,\"Player2\",$AV21))","v":""},{"$f":"IFERROR(GETPIVOTDATA(\"Sum of Relative\",Pivots!$B$3,\"Player2\",$AV21,\"Team\",AY$4)/GETPIVOTDATA(\"Count of Match\",Pivots!$B$3,\"Player2\",$AV21,\"Team\",AY$4),\"\")","v":""},{"$f":"IFERROR(GETPIVOTDATA(\"Sum of Relative\",Pivots!$B$3,\"Player2\",$AV21,\"Team\",AZ$4)/GETPIVOTDATA(\"Count of Match\",Pivots!$B$3,\"Player2\",$AV21,\"Team\",AZ$4),\"\")","v":""},{"$f":"IFERROR(GETPIVOTDATA(\"Sum of Relative\",Pivots!$B$3,\"Player2\",$AV21,\"Team\",BA$4)/GETPIVOTDATA(\"Count of Match\",Pivots!$B$3,\"Player2\",$AV21,\"Team\",BA$4),\"\")","v":""},""]
[null,null,null,null,null,null,null,null,null,{"$f":"Pivots!AH41","v":0},{"$f":"IFERROR(VLOOKUP(J22,Tables!$F$2:$H$40,2),\"\")","v":""},{"$f":"Pivots!AI42","v":0},{"$f":"IF(J22=0,\"\",GETPIVOTDATA(\"Average of Team\",Pivots!AH22,\"Match\",$J22,\"player2\",$L22))","v":""},{"$f":"IF(J22=0,\"\",GETPIVOTDATA(\"Sum of Butler\",Pivots!AI22,\"Match\",$J22,\"player2\",$L22))","v":""},{"$f":"IF(J22=0,\"\",GETPIVOTDATA(\"Sum of MatchS\",Pivots!AJ22,\"Match\",$J22,\"player2\",$L22))","v":""},{"$f":"IF(J22=0,\"\",GETPIVOTDATA(\"Sum of Relative\",Pivots!AK22,\"Match\",$J22,\"player2\",$L22))","v":""},null,null,"DHO",3,{"$f":"IFERROR(GETPIVOTDATA(\"Count of Match\",Pivots!B$3,\"Player2\",S22),\"\")","v":""},null,null,null,"LH",3,3,null,"",null,{"$f":"IF(AG22=\"\",\"\",GETPIVOTDATA(\"Count of Match\",Pivots!$B$3,\"Player2\",$AD22,\"Team\",1)&\"D\")&IF(AH22=\"\",\"\",GETPIVOTDATA(\"Count of Match\",Pivots!$B$3,\"Player2\",$AD22,\"Team\",2)&\"P\")&IF(AI22=\"\",\"\",GETPIVOTDATA(\"Count of Match\",Pivots!$B$3,\"Player2\",$AD22,\"Team\",3)&\"M\")","v":""},{"$f":"IF(AD22=\"\",\"\",GETPIVOTDATA(\"Sum of Relative\",Pivots!$B$3,\"Player2\",$AD22)/GETPIVOTDATA(\"Count of Match\",Pivots!$B$3,\"Player2\",$AD22))","v":""},{"$f":"IFERROR(GETPIVOTDATA(\"Sum of Relative\",Pivots!$B$3,\"Player2\",$AD22,\"Team\",AG$4)/GETPIVOTDATA(\"Count of Match\",Pivots!$B$3,\"Player2\",$AD22,\"Team\",AG$4),\"\")","v":""},{"$f":"IFERROR(GETPIVOTDATA(\"Sum of Relative\",Pivots!$B$3,\"Player2\",$AD22,\"Team\",AH$4)/GETPIVOTDATA(\"Count of Match\",Pivots!$B$3,\"Player2\",$AD22,\"Team\",AH$4),\"\")","v":""},{"$f":"IFERROR(GETPIVOTDATA(\"Sum of Relative\",Pivots!$B$3,\"Player2\",$AD22,\"Team\",AI$4)/GETPIVOTDATA(\"Count of Match\",Pivots!$B$3,\"Player2\",$AD22,\"Team\",AI$4),\"\")","v":""},"",null,"",null,{"$f":"IF(AP22=\"\",\"\",GETPIVOTDATA(\"Count of Match\",Pivots!$B$3,\"Player2\",$AM22,\"Team\",1)&\"D\")&IF(AQ22=\"\",\"\",GETPIVOTDATA(\"Count of Match\",Pivots!$B$3,\"Player2\",$AM22,\"Team\",2)&\"P\")&IF(AR22=\"\",\"\",GETPIVOTDATA(\"Count of Match\",Pivots!$B$3,\"Player2\",$AM22,\"Team\",3)&\"M\")","v":""},{"$f":"IF(AM22=\"\",\"\",GETPIVOTDATA(\"Sum of Relative\",Pivots!$B$3,\"Player2\",$AM22)/GETPIVOTDATA(\"Count of Match\",Pivots!$B$3,\"Player2\",$AM22))","v":""},{"$f":"IFERROR(GETPIVOTDATA(\"Sum of Relative\",Pivots!$B$3,\"Player2\",$AM22,\"Team\",AP$4)/GETPIVOTDATA(\"Count of Match\",Pivots!$B$3,\"Player2\",$AM22,\"Team\",AP$4),\"\")","v":""},{"$f":"IFERROR(GETPIVOTDATA(\"Sum of Relative\",Pivots!$B$3,\"Player2\",$AM22,\"Team\",AQ$4)/GETPIVOTDATA(\"Count of Match\",Pivots!$B$3,\"Player2\",$AM22,\"Team\",AQ$4),\"\")","v":""},{"$f":"IFERROR(GETPIVOTDATA(\"Sum of Relative\",Pivots!$B$3,\"Player2\",$AM22,\"Team\",AR$4)/GETPIVOTDATA(\"Count of Match\",Pivots!$B$3,\"Player2\",$AM22,\"Team\",AR$4),\"\")","v":""},"",null,"",null,{"$f":"IF(AY22=\"\",\"\",GETPIVOTDATA(\"Count of Match\",Pivots!$B$3,\"Player2\",$AV22,\"Team\",1)&\"D\")&IF(AZ22=\"\",\"\",GETPIVOTDATA(\"Count of Match\",Pivots!$B$3,\"Player2\",$AV22,\"Team\",2)&\"P\")&IF(BA22=\"\",\"\",GETPIVOTDATA(\"Count of Match\",Pivots!$B$3,\"Player2\",$AV22,\"Team\",3)&\"M\")","v":""},{"$f":"IF(AV22=\"\",\"\",GETPIVOTDATA(\"Sum of Relative\",Pivots!$B$3,\"Player2\",$AV22)/GETPIVOTDATA(\"Count of Match\",Pivots!$B$3,\"Player2\",$AV22))","v":""},{"$f":"IFERROR(GETPIVOTDATA(\"Sum of Relative\",Pivots!$B$3,\"Player2\",$AV22,\"Team\",AY$4)/GETPIVOTDATA(\"Count of Match\",Pivots!$B$3,\"Player2\",$AV22,\"Team\",AY$4),\"\")","v":""},{"$f":"IFERROR(GETPIVOTDATA(\"Sum of Relative\",Pivots!$B$3,\"Player2\",$AV22,\"Team\",AZ$4)/GETPIVOTDATA(\"Count of Match\",Pivots!$B$3,\"Player2\",$AV22,\"Team\",AZ$4),\"\")","v":""},{"$f":"IFERROR(GETPIVOTDATA(\"Sum of Relative\",Pivots!$B$3,\"Player2\",$AV22,\"Team\",BA$4)/GETPIVOTDATA(\"Count of Match\",Pivots!$B$3,\"Player2\",$AV22,\"Team\",BA$4),\"\")","v":""},""]
[null,null,null,null,null,null,null,null,null,{"$f":"Pivots!AH43","v":0},{"$f":"IFERROR(VLOOKUP(J23,Tables!$F$2:$H$40,2),\"\")","v":""},{"$f":"Pivots!AI44","v":0},{"$f":"IF(J23=0,\"\",GETPIVOTDATA(\"Average of Team\",Pivots!AH23,\"Match\",$J23,\"player2\",$L23))","v":""},{"$f":"IF(J23=0,\"\",GETPIVOTDATA(\"Sum of Butler\",Pivots!AI23,\"Match\",$J23,\"player2\",$L23))","v":""},{"$f":"IF(J23=0,\"\",GETPIVOTDATA(\"Sum of MatchS\",Pivots!AJ23,\"Match\",$J23,\"player2\",$L23))","v":""},{"$f":"IF(J23=0,\"\",GETPIVOTDATA(\"Sum of Relative\",Pivots!AK23,\"Match\",$J23,\"player2\",$L23))","v":""},null,null,"DHP",1,{"$f":"IFERROR(GETPIVOTDATA(\"Count of Match\",Pivots!B$3,\"Player2\",S23),\"\")","v":""},null,null,null,"MB",2,6,null,"",null,{"$f":"IF(AG23=\"\",\"\",GETPIVOTDATA(\"Count of Match\",Pivots!$B$3,\"Player2\",$AD23,\"Team\",1)&\"D\")&IF(AH23=\"\",\"\",GETPIVOTDATA(\"Count of Match\",Pivots!$B$3,\"Player2\",$AD23,\"Team\",2)&\"P\")&IF(AI23=\"\",\"\",GETPIVOTDATA(\"Count of Match\",Pivots!$B$3,\"Player2\",$AD23,\"Team\",3)&\"M\")","v":""},{"$f":"IF(AD23=\"\",\"\",GETPIVOTDATA(\"Sum of Relative\",Pivots!$B$3,\"Player2\",$AD23)/GETPIVOTDATA(\"Count of Match\",Pivots!$B$3,\"Player2\",$AD23))","v":""},{"$f":"IFERROR(GETPIVOTDATA(\"Sum of Relative\",Pivots!$B$3,\"Player2\",$AD23,\"Team\",AG$4)/GETPIVOTDATA(\"Count of Match\",Pivots!$B$3,\"Player2\",$AD23,\"Team\",AG$4),\"\")","v":""},{"$f":"IFERROR(GETPIVOTDATA(\"Sum of Relative\",Pivots!$B$3,\"Player2\",$AD23,\"Team\",AH$4)/GETPIVOTDATA(\"Count of Match\",Pivots!$B$3,\"Player2\",$AD23,\"Team\",AH$4),\"\")","v":""},{"$f":"IFERROR(GETPIVOTDATA(\"Sum of Relative\",Pivots!$B$3,\"Player2\",$AD23,\"Team\",AI$4)/GETPIVOTDATA(\"Count of Match\",Pivots!$B$3,\"Player2\",$AD23,\"Team\",AI$4),\"\")","v":""},"",null,"",null,{"$f":"IF(AP23=\"\",\"\",GETPIVOTDATA(\"Count of Match\",Pivots!$B$3,\"Player2\",$AM23,\"Team\",1)&\"D\")&IF(AQ23=\"\",\"\",GETPIVOTDATA(\"Count of Match\",Pivots!$B$3,\"Player2\",$AM23,\"Team\",2)&\"P\")&IF(AR23=\"\",\"\",GETPIVOTDATA(\"Count of Match\",Pivots!$B$3,\"Player2\",$AM23,\"Team\",3)&\"M\")","v":""},{"$f":"IF(AM23=\"\",\"\",GETPIVOTDATA(\"Sum of Relative\",Pivots!$B$3,\"Player2\",$AM23)/GETPIVOTDATA(\"Count of Match\",Pivots!$B$3,\"Player2\",$AM23))","v":""},{"$f":"IFERROR(GETPIVOTDATA(\"Sum of Relative\",Pivots!$B$3,\"Player2\",$AM23,\"Team\",AP$4)/GETPIVOTDATA(\"Count of Match\",Pivots!$B$3,\"Player2\",$AM23,\"Team\",AP$4),\"\")","v":""},{"$f":"IFERROR(GETPIVOTDATA(\"Sum of Relative\",Pivots!$B$3,\"Player2\",$AM23,\"Team\",AQ$4)/GETPIVOTDATA(\"Count of Match\",Pivots!$B$3,\"Player2\",$AM23,\"Team\",AQ$4),\"\")","v":""},{"$f":"IFERROR(GETPIVOTDATA(\"Sum of Relative\",Pivots!$B$3,\"Player2\",$AM23,\"Team\",AR$4)/GETPIVOTDATA(\"Count of Match\",Pivots!$B$3,\"Player2\",$AM23,\"Team\",AR$4),\"\")","v":""},"",null,"",null,{"$f":"IF(AY23=\"\",\"\",GETPIVOTDATA(\"Count of Match\",Pivots!$B$3,\"Player2\",$AV23,\"Team\",1)&\"D\")&IF(AZ23=\"\",\"\",GETPIVOTDATA(\"Count of Match\",Pivots!$B$3,\"Player2\",$AV23,\"Team\",2)&\"P\")&IF(BA23=\"\",\"\",GETPIVOTDATA(\"Count of Match\",Pivots!$B$3,\"Player2\",$AV23,\"Team\",3)&\"M\")","v":""},{"$f":"IF(AV23=\"\",\"\",GETPIVOTDATA(\"Sum of Relative\",Pivots!$B$3,\"Player2\",$AV23)/GETPIVOTDATA(\"Count of Match\",Pivots!$B$3,\"Player2\",$AV23))","v":""},{"$f":"IFERROR(GETPIVOTDATA(\"Sum of Relative\",Pivots!$B$3,\"Player2\",$AV23,\"Team\",AY$4)/GETPIVOTDATA(\"Count of Match\",Pivots!$B$3,\"Player2\",$AV23,\"Team\",AY$4),\"\")","v":""},{"$f":"IFERROR(GETPIVOTDATA(\"Sum of Relative\",Pivots!$B$3,\"Player2\",$AV23,\"Team\",AZ$4)/GETPIVOTDATA(\"Count of Match\",Pivots!$B$3,\"Player2\",$AV23,\"Team\",AZ$4),\"\")","v":""},{"$f":"IFERROR(GETPIVOTDATA(\"Sum of Relative\",Pivots!$B$3,\"Player2\",$AV23,\"Team\",BA$4)/GETPIVOTDATA(\"Count of Match\",Pivots!$B$3,\"Player2\",$AV23,\"Team\",BA$4),\"\")","v":""},""]
[null,null,null,null,null,null,null,null,null,{"$f":"Pivots!AH45","v":0},{"$f":"IFERROR(VLOOKUP(J24,Tables!$F$2:$H$40,2),\"\")","v":""},{"$f":"Pivots!AI46","v":0},{"$f":"IF(J24=0,\"\",GETPIVOTDATA(\"Average of Team\",Pivots!AH24,\"Match\",$J24,\"player2\",$L24))","v":""},{"$f":"IF(J24=0,\"\",GETPIVOTDATA(\"Sum of Butler\",Pivots!AI24,\"Match\",$J24,\"player2\",$L24))","v":""},{"$f":"IF(J24=0,\"\",GETPIVOTDATA(\"Sum of MatchS\",Pivots!AJ24,\"Match\",$J24,\"player2\",$L24))","v":""},{"$f":"IF(J24=0,\"\",GETPIVOTDATA(\"Sum of Relative\",Pivots!AK24,\"Match\",$J24,\"player2\",$L24))","v":""},null,null,"DN",1,{"$f":"IFERROR(GETPIVOTDATA(\"Count of Match\",Pivots!B$3,\"Player2\",S24),\"\")","v":""},null,null,null,"ML",3,1,null,"",null,{"$f":"IF(AG24=\"\",\"\",GETPIVOTDATA(\"Count of Match\",Pivots!$B$3,\"Player2\",$AD24,\"Team\",1)&\"D\")&IF(AH24=\"\",\"\",GETPIVOTDATA(\"Count of Match\",Pivots!$B$3,\"Player2\",$AD24,\"Team\",2)&\"P\")&IF(AI24=\"\",\"\",GETPIVOTDATA(\"Count of Match\",Pivots!$B$3,\"Player2\",$AD24,\"Team\",3)&\"M\")","v":""},{"$f":"IF(AD24=\"\",\"\",GETPIVOTDATA(\"Sum of Relative\",Pivots!$B$3,\"Player2\",$AD24)/GETPIVOTDATA(\"Count of Match\",Pivots!$B$3,\"Player2\",$AD24))","v":""},{"$f":"IFERROR(GETPIVOTDATA(\"Sum of Relative\",Pivots!$B$3,\"Player2\",$AD24,\"Team\",AG$4)/GETPIVOTDATA(\"Count of Match\",Pivots!$B$3,\"Player2\",$AD24,\"Team\",AG$4),\"\")","v":""},{"$f":"IFERROR(GETPIVOTDATA(\"Sum of Relative\",Pivots!$B$3,\"Player2\",$AD24,\"Team\",AH$4)/GETPIVOTDATA(\"Count of Match\",Pivots!$B$3,\"Player2\",$AD24,\"Team\",AH$4),\"\")","v":""},{"$f":"IFERROR(GETPIVOTDATA(\"Sum of Relative\",Pivots!$B$3,\"Player2\",$AD24,\"Team\",AI$4)/GETPIVOTDATA(\"Count of Match\",Pivots!$B$3,\"Player2\",$AD24,\"Team\",AI$4),\"\")","v":""},"",null,"",null,{"$f":"IF(AP24=\"\",\"\",GETPIVOTDATA(\"Count of Match\",Pivots!$B$3,\"Player2\",$AM24,\"Team\",1)&\"D\")&IF(AQ24=\"\",\"\",GETPIVOTDATA(\"Count of Match\",Pivots!$B$3,\"Player2\",$AM24,\"Team\",2)&\"P\")&IF(AR24=\"\",\"\",GETPIVOTDATA(\"Count of Match\",Pivots!$B$3,\"Player2\",$AM24,\"Team\",3)&\"M\")","v":""},{"$f":"IF(AM24=\"\",\"\",GETPIVOTDATA(\"Sum of Relative\",Pivots!$B$3,\"Player2\",$AM24)/GETPIVOTDATA(\"Count of Match\",Pivots!$B$3,\"Player2\",$AM24))","v":""},{"$f":"IFERROR(GETPIVOTDATA(\"Sum of Relative\",Pivots!$B$3,\"Player2\",$AM24,\"Team\",AP$4)/GETPIVOTDATA(\"Count of Match\",Pivots!$B$3,\"Player2\",$AM24,\"Team\",AP$4),\"\")","v":""},{"$f":"IFERROR(GETPIVOTDATA(\"Sum of Relative\",Pivots!$B$3,\"Player2\",$AM24,\"Team\",AQ$4)/GETPIVOTDATA(\"Count of Match\",Pivots!$B$3,\"Player2\",$AM24,\"Team\",AQ$4),\"\")","v":""},{"$f":"IFERROR(GETPIVOTDATA(\"Sum of Relative\",Pivots!$B$3,\"Player2\",$AM24,\"Team\",AR$4)/GETPIVOTDATA(\"Count of Match\",Pivots!$B$3,\"Player2\",$AM24,\"Team\",AR$4),\"\")","v":""},"",null,"",null,{"$f":"IF(AY24=\"\",\"\",GETPIVOTDATA(\"Count of Match\",Pivots!$B$3,\"Player2\",$AV24,\"Team\",1)&\"D\")&IF(AZ24=\"\",\"\",GETPIVOTDATA(\"Count of Match\",Pivots!$B$3,\"Player2\",$AV24,\"Team\",2)&\"P\")&IF(BA24=\"\",\"\",GETPIVOTDATA(\"Count of Match\",Pivots!$B$3,\"Player2\",$AV24,\"Team\",3)&\"M\")","v":""},{"$f":"IF(AV24=\"\",\"\",GETPIVOTDATA(\"Sum of Relative\",Pivots!$B$3,\"Player2\",$AV24)/GETPIVOTDATA(\"Count of Match\",Pivots!$B$3,\"Player2\",$AV24))","v":""},{"$f":"IFERROR(GETPIVOTDATA(\"Sum of Relative\",Pivots!$B$3,\"Player2\",$AV24,\"Team\",AY$4)/GETPIVOTDATA(\"Count of Match\",Pivots!$B$3,\"Player2\",$AV24,\"Team\",AY$4),\"\")","v":""},{"$f":"IFERROR(GETPIVOTDATA(\"Sum of Relative\",Pivots!$B$3,\"Player2\",$AV24,\"Team\",AZ$4)/GETPIVOTDATA(\"Count of Match\",Pivots!$B$3,\"Player2\",$AV24,\"Team\",AZ$4),\"\")","v":""},{"$f":"IFERROR(GETPIVOTDATA(\"Sum of Relative\",Pivots!$B$3,\"Player2\",$AV24,\"Team\",BA$4)/GETPIVOTDATA(\"Count of Match\",Pivots!$B$3,\"Player2\",$AV24,\"Team\",BA$4),\"\")","v":""},""]
[null,null,null,null,null,null,null,null,null,{"$f":"Pivots!AH47","v":0},{"$f":"IFERROR(VLOOKUP(J25,Tables!$F$2:$H$40,2),\"\")","v":""},{"$f":"Pivots!AI48","v":0},{"$f":"IF(J25=0,\"\",GETPIVOTDATA(\"Average of Team\",Pivots!AH25,\"Match\",$J25,\"player2\",$L25))","v":""},{"$f":"IF(J25=0,\"\",GETPIVOTDATA(\"Sum of Butler\",Pivots!AI25,\"Match\",$J25,\"player2\",$L25))","v":""},{"$f":"IF(J25=0,\"\",GETPIVOTDATA(\"Sum of MatchS\",Pivots!AJ25,\"Match\",$J25,\"player2\",$L25))","v":""},{"$f":"IF(J25=0,\"\",GETPIVOTDATA(\"Sum of Relative\",Pivots!AK25,\"Match\",$J25,\"player2\",$L25))","v":""},null,null,"DR",1,{"$f":"IFERROR(GETPIVOTDATA(\"Count of Match\",Pivots!B$3,\"Player2\",S25),\"\")","v":""},null,null,null,"MR",2,10,null,"",null,{"$f":"IF(AG25=\"\",\"\",GETPIVOTDATA(\"Count of Match\",Pivots!$B$3,\"Player2\",$AD25,\"Team\",1)&\"D\")&IF(AH25=\"\",\"\",GETPIVOTDATA(\"Count of Match\",Pivots!$B$3,\"Player2\",$AD25,\"Team\",2)&\"P\")&IF(AI25=\"\",\"\",GETPIVOTDATA(\"Count of Match\",Pivots!$B$3,\"Player2\",$AD25,\"Team\",3)&\"M\")","v":""},{"$f":"IF(AD25=\"\",\"\",GETPIVOTDATA(\"Sum of Relative\",Pivots!$B$3,\"Player2\",$AD25)/GETPIVOTDATA(\"Count of Match\",Pivots!$B$3,\"Player2\",$AD25))","v":""},{"$f":"IFERROR(GETPIVOTDATA(\"Sum of Relative\",Pivots!$B$3,\"Player2\",$AD25,\"Team\",AG$4)/GETPIVOTDATA(\"Count of Match\",Pivots!$B$3,\"Player2\",$AD25,\"Team\",AG$4),\"\")","v":""},{"$f":"IFERROR(GETPIVOTDATA(\"Sum of Relative\",Pivots!$B$3,\"Player2\",$AD25,\"Team\",AH$4)/GETPIVOTDATA(\"Count of Match\",Pivots!$B$3,\"Player2\",$AD25,\"Team\",AH$4),\"\")","v":""},{"$f":"IFERROR(GETPIVOTDATA(\"Sum of Relative\",Pivots!$B$3,\"Player2\",$AD25,\"Team\",AI$4)/GETPIVOTDATA(\"Count of Match\",Pivots!$B$3,\"Player2\",$AD25,\"Team\",AI$4),\"\")","v":""},"",null,"",null,{"$f":"IF(AP25=\"\",\"\",GETPIVOTDATA(\"Count of Match\",Pivots!$B$3,\"Player2\",$AM25,\"Team\",1)&\"D\")&IF(AQ25=\"\",\"\",GETPIVOTDATA(\"Count of Match\",Pivots!$B$3,\"Player2\",$AM25,\"Team\",2)&\"P\")&IF(AR25=\"\",\"\",GETPIVOTDATA(\"Count of Match\",Pivots!$B$3,\"Player2\",$AM25,\"Team\",3)&\"M\")","v":""},{"$f":"IF(AM25=\"\",\"\",GETPIVOTDATA(\"Sum of Relative\",Pivots!$B$3,\"Player2\",$AM25)/GETPIVOTDATA(\"Count of Match\",Pivots!$B$3,\"Player2\",$AM25))","v":""},{"$f":"IFERROR(GETPIVOTDATA(\"Sum of Relative\",Pivots!$B$3,\"Player2\",$AM25,\"Team\",AP$4)/GETPIVOTDATA(\"Count of Match\",Pivots!$B$3,\"Player2\",$AM25,\"Team\",AP$4),\"\")","v":""},{"$f":"IFERROR(GETPIVOTDATA(\"Sum of Relative\",Pivots!$B$3,\"Player2\",$AM25,\"Team\",AQ$4)/GETPIVOTDATA(\"Count of Match\",Pivots!$B$3,\"Player2\",$AM25,\"Team\",AQ$4),\"\")","v":""},{"$f":"IFERROR(GETPIVOTDATA(\"Sum of Relative\",Pivots!$B$3,\"Player2\",$AM25,\"Team\",AR$4)/GETPIVOTDATA(\"Count of Match\",Pivots!$B$3,\"Player2\",$AM25,\"Team\",AR$4),\"\")","v":""},"",null,"",null,{"$f":"IF(AY25=\"\",\"\",GETPIVOTDATA(\"Count of Match\",Pivots!$B$3,\"Player2\",$AV25,\"Team\",1)&\"D\")&IF(AZ25=\"\",\"\",GETPIVOTDATA(\"Count of Match\",Pivots!$B$3,\"Player2\",$AV25,\"Team\",2)&\"P\")&IF(BA25=\"\",\"\",GETPIVOTDATA(\"Count of Match\",Pivots!$B$3,\"Player2\",$AV25,\"Team\",3)&\"M\")","v":""},{"$f":"IF(AV25=\"\",\"\",GETPIVOTDATA(\"Sum of Relative\",Pivots!$B$3,\"Player2\",$AV25)/GETPIVOTDATA(\"Count of Match\",Pivots!$B$3,\"Player2\",$AV25))","v":""},{"$f":"IFERROR(GETPIVOTDATA(\"Sum of Relative\",Pivots!$B$3,\"Player2\",$AV25,\"Team\",AY$4)/GETPIVOTDATA(\"Count of Match\",Pivots!$B$3,\"Player2\",$AV25,\"Team\",AY$4),\"\")","v":""},{"$f":"IFERROR(GETPIVOTDATA(\"Sum of Relative\",Pivots!$B$3,\"Player2\",$AV25,\"Team\",AZ$4)/GETPIVOTDATA(\"Count of Match\",Pivots!$B$3,\"Player2\",$AV25,\"Team\",AZ$4),\"\")","v":""},{"$f":"IFERROR(GETPIVOTDATA(\"Sum of Relative\",Pivots!$B$3,\"Player2\",$AV25,\"Team\",BA$4)/GETPIVOTDATA(\"Count of Match\",Pivots!$B$3,\"Player2\",$AV25,\"Team\",BA$4),\"\")","v":""},""]
[null,null,null,null,null,null,null,null,null,{"$f":"Pivots!AH49","v":0},{"$f":"IFERROR(VLOOKUP(J26,Tables!$F$2:$H$40,2),\"\")","v":""},{"$f":"Pivots!AI50","v":0},{"$f":"IF(J26=0,\"\",GETPIVOTDATA(\"Average of Team\",Pivots!AH26,\"Match\",$J26,\"player2\",$L26))","v":""},{"$f":"IF(J26=0,\"\",GETPIVOTDATA(\"Sum of Butler\",Pivots!AI26,\"Match\",$J26,\"player2\",$L26))","v":""},{"$f":"IF(J26=0,\"\",GETPIVOTDATA(\"Sum of MatchS\",Pivots!AJ26,\"Match\",$J26,\"player2\",$L26))","v":""},{"$f":"IF(J26=0,\"\",GETPIVOTDATA(\"Sum of Relative\",Pivots!AK26,\"Match\",$J26,\"player2\",$L26))","v":""},null,null,"DS",3,{"$f":"IFERROR(GETPIVOTDATA(\"Count of Match\",Pivots!B$3,\"Player2\",S26),\"\")","v":""},null,null,null,"MW",2,9,null,"",null,{"$f":"IF(AG26=\"\",\"\",GETPIVOTDATA(\"Count of Match\",Pivots!$B$3,\"Player2\",$AD26,\"Team\",1)&\"D\")&IF(AH26=\"\",\"\",GETPIVOTDATA(\"Count of Match\",Pivots!$B$3,\"Player2\",$AD26,\"Team\",2)&\"P\")&IF(AI26=\"\",\"\",GETPIVOTDATA(\"Count of Match\",Pivots!$B$3,\"Player2\",$AD26,\"Team\",3)&\"M\")","v":""},{"$f":"IF(AD26=\"\",\"\",GETPIVOTDATA(\"Sum of Relative\",Pivots!$B$3,\"Player2\",$AD26)/GETPIVOTDATA(\"Count of Match\",Pivots!$B$3,\"Player2\",$AD26))","v":""},{"$f":"IFERROR(GETPIVOTDATA(\"Sum of Relative\",Pivots!$B$3,\"Player2\",$AD26,\"Team\",AG$4)/GETPIVOTDATA(\"Count of Match\",Pivots!$B$3,\"Player2\",$AD26,\"Team\",AG$4),\"\")","v":""},{"$f":"IFERROR(GETPIVOTDATA(\"Sum of Relative\",Pivots!$B$3,\"Player2\",$AD26,\"Team\",AH$4)/GETPIVOTDATA(\"Count of Match\",Pivots!$B$3,\"Player2\",$AD26,\"Team\",AH$4),\"\")","v":""},{"$f":"IFERROR(GETPIVOTDATA(\"Sum of Relative\",Pivots!$B$3,\"Player2\",$AD26,\"Team\",AI$4)/GETPIVOTDATA(\"Count of Match\",Pivots!$B$3,\"Player2\",$AD26,\"Team\",AI$4),\"\")","v":""},"",null,"",null,{"$f":"IF(AP26=\"\",\"\",GETPIVOTDATA(\"Count of Match\",Pivots!$B$3,\"Player2\",$AM26,\"Team\",1)&\"D\")&IF(AQ26=\"\",\"\",GETPIVOTDATA(\"Count of Match\",Pivots!$B$3,\"Player2\",$AM26,\"Team\",2)&\"P\")&IF(AR26=\"\",\"\",GETPIVOTDATA(\"Count of Match\",Pivots!$B$3,\"Player2\",$AM26,\"Team\",3)&\"M\")","v":""},{"$f":"IF(AM26=\"\",\"\",GETPIVOTDATA(\"Sum of Relative\",Pivots!$B$3,\"Player2\",$AM26)/GETPIVOTDATA(\"Count of Match\",Pivots!$B$3,\"Player2\",$AM26))","v":""},{"$f":"IFERROR(GETPIVOTDATA(\"Sum of Relative\",Pivots!$B$3,\"Player2\",$AM26,\"Team\",AP$4)/GETPIVOTDATA(\"Count of Match\",Pivots!$B$3,\"Player2\",$AM26,\"Team\",AP$4),\"\")","v":""},{"$f":"IFERROR(GETPIVOTDATA(\"Sum of Relative\",Pivots!$B$3,\"Player2\",$AM26,\"Team\",AQ$4)/GETPIVOTDATA(\"Count of Match\",Pivots!$B$3,\"Player2\",$AM26,\"Team\",AQ$4),\"\")","v":""},{"$f":"IFERROR(GETPIVOTDATA(\"Sum of Relative\",Pivots!$B$3,\"Player2\",$AM26,\"Team\",AR$4)/GETPIVOTDATA(\"Count of Match\",Pivots!$B$3,\"Player2\",$AM26,\"Team\",AR$4),\"\")","v":""},"",null,"",null,{"$f":"IF(AY26=\"\",\"\",GETPIVOTDATA(\"Count of Match\",Pivots!$B$3,\"Player2\",$AV26,\"Team\",1)&\"D\")&IF(AZ26=\"\",\"\",GETPIVOTDATA(\"Count of Match\",Pivots!$B$3,\"Player2\",$AV26,\"Team\",2)&\"P\")&IF(BA26=\"\",\"\",GETPIVOTDATA(\"Count of Match\",Pivots!$B$3,\"Player2\",$AV26,\"Team\",3)&\"M\")","v":""},{"$f":"IF(AV26=\"\",\"\",GETPIVOTDATA(\"Sum of Relative\",Pivots!$B$3,\"Player2\",$AV26)/GETPIVOTDATA(\"Count of Match\",Pivots!$B$3,\"Player2\",$AV26))","v":""},{"$f":"IFERROR(GETPIVOTDATA(\"Sum of Relative\",Pivots!$B$3,\"Player2\",$AV26,\"Team\",AY$4)/GETPIVOTDATA(\"Count of Match\",Pivots!$B$3,\"Player2\",$AV26,\"Team\",AY$4),\"\")","v":""},{"$f":"IFERROR(GETPIVOTDATA(\"Sum of Relative\",Pivots!$B$3,\"Player2\",$AV26,\"Team\",AZ$4)/GETPIVOTDATA(\"Count of Match\",Pivots!$B$3,\"Player2\",$AV26,\"Team\",AZ$4),\"\")","v":""},{"$f":"IFERROR(GETPIVOTDATA(\"Sum of Relative\",Pivots!$B$3,\"Player2\",$AV26,\"Team\",BA$4)/GETPIVOTDATA(\"Count of Match\",Pivots!$B$3,\"Player2\",$AV26,\"Team\",BA$4),\"\")","v":""},""]
[null,null,null,null,null,null,null,null,null,{"$f":"Pivots!AH51","v":0},{"$f":"IFERROR(VLOOKUP(J27,Tables!$F$2:$H$40,2),\"\")","v":""},{"$f":"Pivots!AI52","v":0},{"$f":"IF(J27=0,\"\",GETPIVOTDATA(\"Average of Team\",Pivots!AH27,\"Match\",$J27,\"player2\",$L27))","v":""},{"$f":"IF(J27=0,\"\",GETPIVOTDATA(\"Sum of Butler\",Pivots!AI27,\"Match\",$J27,\"player2\",$L27))","v":""},{"$f":"IF(J27=0,\"\",GETPIVOTDATA(\"Sum of MatchS\",Pivots!AJ27,\"Match\",$J27,\"player2\",$L27))","v":""},{"$f":"IF(J27=0,\"\",GETPIVOTDATA(\"Sum of Relative\",Pivots!AK27,\"Match\",$J27,\"player2\",$L27))","v":""},null,null,"ED",3,{"$f":"IFERROR(GETPIVOTDATA(\"Count of Match\",Pivots!B$3,\"Player2\",S27),\"\")","v":""},null,null,null,"PD",1,12,null,"",null,{"$f":"IF(AG27=\"\",\"\",GETPIVOTDATA(\"Count of Match\",Pivots!$B$3,\"Player2\",$AD27,\"Team\",1)&\"D\")&IF(AH27=\"\",\"\",GETPIVOTDATA(\"Count of Match\",Pivots!$B$3,\"Player2\",$AD27,\"Team\",2)&\"P\")&IF(AI27=\"\",\"\",GETPIVOTDATA(\"Count of Match\",Pivots!$B$3,\"Player2\",$AD27,\"Team\",3)&\"M\")","v":""},{"$f":"IF(AD27=\"\",\"\",GETPIVOTDATA(\"Sum of Relative\",Pivots!$B$3,\"Player2\",$AD27)/GETPIVOTDATA(\"Count of Match\",Pivots!$B$3,\"Player2\",$AD27))","v":""},{"$f":"IFERROR(GETPIVOTDATA(\"Sum of Relative\",Pivots!$B$3,\"Player2\",$AD27,\"Team\",AG$4)/GETPIVOTDATA(\"Count of Match\",Pivots!$B$3,\"Player2\",$AD27,\"Team\",AG$4),\"\")","v":""},{"$f":"IFERROR(GETPIVOTDATA(\"Sum of Relative\",Pivots!$B$3,\"Player2\",$AD27,\"Team\",AH$4)/GETPIVOTDATA(\"Count of Match\",Pivots!$B$3,\"Player2\",$AD27,\"Team\",AH$4),\"\")","v":""},{"$f":"IFERROR(GETPIVOTDATA(\"Sum of Relative\",Pivots!$B$3,\"Player2\",$AD27,\"Team\",AI$4)/GETPIVOTDATA(\"Count of Match\",Pivots!$B$3,\"Player2\",$AD27,\"Team\",AI$4),\"\")","v":""},"",null,"",null,{"$f":"IF(AP27=\"\",\"\",GETPIVOTDATA(\"Count of Match\",Pivots!$B$3,\"Player2\",$AM27,\"Team\",1)&\"D\")&IF(AQ27=\"\",\"\",GETPIVOTDATA(\"Count of Match\",Pivots!$B$3,\"Player2\",$AM27,\"Team\",2)&\"P\")&IF(AR27=\"\",\"\",GETPIVOTDATA(\"Count of Match\",Pivots!$B$3,\"Player2\",$AM27,\"Team\",3)&\"M\")","v":""},{"$f":"IF(AM27=\"\",\"\",GETPIVOTDATA(\"Sum of Relative\",Pivots!$B$3,\"Player2\",$AM27)/GETPIVOTDATA(\"Count of Match\",Pivots!$B$3,\"Player2\",$AM27))","v":""},{"$f":"IFERROR(GETPIVOTDATA(\"Sum of Relative\",Pivots!$B$3,\"Player2\",$AM27,\"Team\",AP$4)/GETPIVOTDATA(\"Count of Match\",Pivots!$B$3,\"Player2\",$AM27,\"Team\",AP$4),\"\")","v":""},{"$f":"IFERROR(GETPIVOTDATA(\"Sum of Relative\",Pivots!$B$3,\"Player2\",$AM27,\"Team\",AQ$4)/GETPIVOTDATA(\"Count of Match\",Pivots!$B$3,\"Player2\",$AM27,\"Team\",AQ$4),\"\")","v":""},{"$f":"IFERROR(GETPIVOTDATA(\"Sum of Relative\",Pivots!$B$3,\"Player2\",$AM27,\"Team\",AR$4)/GETPIVOTDATA(\"Count of Match\",Pivots!$B$3,\"Player2\",$AM27,\"Team\",AR$4),\"\")","v":""},"",null,"",null,{"$f":"IF(AY27=\"\",\"\",GETPIVOTDATA(\"Count of Match\",Pivots!$B$3,\"Player2\",$AV27,\"Team\",1)&\"D\")&IF(AZ27=\"\",\"\",GETPIVOTDATA(\"Count of Match\",Pivots!$B$3,\"Player2\",$AV27,\"Team\",2)&\"P\")&IF(BA27=\"\",\"\",GETPIVOTDATA(\"Count of Match\",Pivots!$B$3,\"Player2\",$AV27,\"Team\",3)&\"M\")","v":""},{"$f":"IF(AV27=\"\",\"\",GETPIVOTDATA(\"Sum of Relative\",Pivots!$B$3,\"Player2\",$AV27)/GETPIVOTDATA(\"Count of Match\",Pivots!$B$3,\"Player2\",$AV27))","v":""},{"$f":"IFERROR(GETPIVOTDATA(\"Sum of Relative\",Pivots!$B$3,\"Player2\",$AV27,\"Team\",AY$4)/GETPIVOTDATA(\"Count of Match\",Pivots!$B$3,\"Player2\",$AV27,\"Team\",AY$4),\"\")","v":""},{"$f":"IFERROR(GETPIVOTDATA(\"Sum of Relative\",Pivots!$B$3,\"Player2\",$AV27,\"Team\",AZ$4)/GETPIVOTDATA(\"Count of Match\",Pivots!$B$3,\"Player2\",$AV27,\"Team\",AZ$4),\"\")","v":""},{"$f":"IFERROR(GETPIVOTDATA(\"Sum of Relative\",Pivots!$B$3,\"Player2\",$AV27,\"Team\",BA$4)/GETPIVOTDATA(\"Count of Match\",Pivots!$B$3,\"Player2\",$AV27,\"Team\",BA$4),\"\")","v":""},""]
[null,null,null,null,null,null,null,null,null,{"$f":"Pivots!AH53","v":0},{"$f":"IFERROR(VLOOKUP(J28,Tables!$F$2:$H$40,2),\"\")","v":""},{"$f":"Pivots!AI54","v":0},{"$f":"IF(J28=0,\"\",GETPIVOTDATA(\"Average of Team\",Pivots!AH28,\"Match\",$J28,\"player2\",$L28))","v":""},{"$f":"IF(J28=0,\"\",GETPIVOTDATA(\"Sum of Butler\",Pivots!AI28,\"Match\",$J28,\"player2\",$L28))","v":""},{"$f":"IF(J28=0,\"\",GETPIVOTDATA(\"Sum of MatchS\",Pivots!AJ28,\"Match\",$J28,\"player2\",$L28))","v":""},{"$f":"IF(J28=0,\"\",GETPIVOTDATA(\"Sum of Relative\",Pivots!AK28,\"Match\",$J28,\"player2\",$L28))","v":""},null,null,"GB",2,{"$f":"IFERROR(GETPIVOTDATA(\"Count of Match\",Pivots!B$3,\"Player2\",S28),\"\")","v":""},null,null,null,"PL",2,9,null,"",null,{"$f":"IF(AG28=\"\",\"\",GETPIVOTDATA(\"Count of Match\",Pivots!$B$3,\"Player2\",$AD28,\"Team\",1)&\"D\")&IF(AH28=\"\",\"\",GETPIVOTDATA(\"Count of Match\",Pivots!$B$3,\"Player2\",$AD28,\"Team\",2)&\"P\")&IF(AI28=\"\",\"\",GETPIVOTDATA(\"Count of Match\",Pivots!$B$3,\"Player2\",$AD28,\"Team\",3)&\"M\")","v":""},{"$f":"IF(AD28=\"\",\"\",GETPIVOTDATA(\"Sum of Relative\",Pivots!$B$3,\"Player2\",$AD28)/GETPIVOTDATA(\"Count of Match\",Pivots!$B$3,\"Player2\",$AD28))","v":""},{"$f":"IFERROR(GETPIVOTDATA(\"Sum of Relative\",Pivots!$B$3,\"Player2\",$AD28,\"Team\",AG$4)/GETPIVOTDATA(\"Count of Match\",Pivots!$B$3,\"Player2\",$AD28,\"Team\",AG$4),\"\")","v":""},{"$f":"IFERROR(GETPIVOTDATA(\"Sum of Relative\",Pivots!$B$3,\"Player2\",$AD28,\"Team\",AH$4)/GETPIVOTDATA(\"Count of Match\",Pivots!$B$3,\"Player2\",$AD28,\"Team\",AH$4),\"\")","v":""},{"$f":"IFERROR(GETPIVOTDATA(\"Sum of Relative\",Pivots!$B$3,\"Player2\",$AD28,\"Team\",AI$4)/GETPIVOTDATA(\"Count of Match\",Pivots!$B$3,\"Player2\",$AD28,\"Team\",AI$4),\"\")","v":""},"",null,"",null,{"$f":"IF(AP28=\"\",\"\",GETPIVOTDATA(\"Count of Match\",Pivots!$B$3,\"Player2\",$AM28,\"Team\",1)&\"D\")&IF(AQ28=\"\",\"\",GETPIVOTDATA(\"Count of Match\",Pivots!$B$3,\"Player2\",$AM28,\"Team\",2)&\"P\")&IF(AR28=\"\",\"\",GETPIVOTDATA(\"Count of Match\",Pivots!$B$3,\"Player2\",$AM28,\"Team\",3)&\"M\")","v":""},{"$f":"IF(AM28=\"\",\"\",GETPIVOTDATA(\"Sum of Relative\",Pivots!$B$3,\"Player2\",$AM28)/GETPIVOTDATA(\"Count of Match\",Pivots!$B$3,\"Player2\",$AM28))","v":""},{"$f":"IFERROR(GETPIVOTDATA(\"Sum of Relative\",Pivots!$B$3,\"Player2\",$AM28,\"Team\",AP$4)/GETPIVOTDATA(\"Count of Match\",Pivots!$B$3,\"Player2\",$AM28,\"Team\",AP$4),\"\")","v":""},{"$f":"IFERROR(GETPIVOTDATA(\"Sum of Relative\",Pivots!$B$3,\"Player2\",$AM28,\"Team\",AQ$4)/GETPIVOTDATA(\"Count of Match\",Pivots!$B$3,\"Player2\",$AM28,\"Team\",AQ$4),\"\")","v":""},{"$f":"IFERROR(GETPIVOTDATA(\"Sum of Relative\",Pivots!$B$3,\"Player2\",$AM28,\"Team\",AR$4)/GETPIVOTDATA(\"Count of Match\",Pivots!$B$3,\"Player2\",$AM28,\"Team\",AR$4),\"\")","v":""},"",null,"",null,{"$f":"IF(AY28=\"\",\"\",GETPIVOTDATA(\"Count of Match\",Pivots!$B$3,\"Player2\",$AV28,\"Team\",1)&\"D\")&IF(AZ28=\"\",\"\",GETPIVOTDATA(\"Count of Match\",Pivots!$B$3,\"Player2\",$AV28,\"Team\",2)&\"P\")&IF(BA28=\"\",\"\",GETPIVOTDATA(\"Count of Match\",Pivots!$B$3,\"Player2\",$AV28,\"Team\",3)&\"M\")","v":""},{"$f":"IF(AV28=\"\",\"\",GETPIVOTDATA(\"Sum of Relative\",Pivots!$B$3,\"Player2\",$AV28)/GETPIVOTDATA(\"Count of Match\",Pivots!$B$3,\"Player2\",$AV28))","v":""},{"$f":"IFERROR(GETPIVOTDATA(\"Sum of Relative\",Pivots!$B$3,\"Player2\",$AV28,\"Team\",AY$4)/GETPIVOTDATA(\"Count of Match\",Pivots!$B$3,\"Player2\",$AV28,\"Team\",AY$4),\"\")","v":""},{"$f":"IFERROR(GETPIVOTDATA(\"Sum of Relative\",Pivots!$B$3,\"Player2\",$AV28,\"Team\",AZ$4)/GETPIVOTDATA(\"Count of Match\",Pivots!$B$3,\"Player2\",$AV28,\"Team\",AZ$4),\"\")","v":""},{"$f":"IFERROR(GETPIVOTDATA(\"Sum of Relative\",Pivots!$B$3,\"Player2\",$AV28,\"Team\",BA$4)/GETPIVOTDATA(\"Count of Match\",Pivots!$B$3,\"Player2\",$AV28,\"Team\",BA$4),\"\")","v":""},""]
[null,null,null,null,null,null,null,null,null,{"$f":"Pivots!AH55","v":0},{"$f":"IFERROR(VLOOKUP(J29,Tables!$F$2:$H$40,2),\"\")","v":""},{"$f":"Pivots!AI56","v":0},{"$f":"IF(J29=0,\"\",GETPIVOTDATA(\"Average of Team\",Pivots!AH29,\"Match\",$J29,\"player2\",$L29))","v":""},{"$f":"IF(J29=0,\"\",GETPIVOTDATA(\"Sum of Butler\",Pivots!AI29,\"Match\",$J29,\"player2\",$L29))","v":""},{"$f":"IF(J29=0,\"\",GETPIVOTDATA(\"Sum of MatchS\",Pivots!AJ29,\"Match\",$J29,\"player2\",$L29))","v":""},{"$f":"IF(J29=0,\"\",GETPIVOTDATA(\"Sum of Relative\",Pivots!AK29,\"Match\",$J29,\"player2\",$L29))","v":""},null,null,"GS",1,{"$f":"IFERROR(GETPIVOTDATA(\"Count of Match\",Pivots!B$3,\"Player2\",S29),\"\")","v":""},null,null,null,"PPE",2,6,null,"",null,{"$f":"IF(AG29=\"\",\"\",GETPIVOTDATA(\"Count of Match\",Pivots!$B$3,\"Player2\",$AD29,\"Team\",1)&\"D\")&IF(AH29=\"\",\"\",GETPIVOTDATA(\"Count of Match\",Pivots!$B$3,\"Player2\",$AD29,\"Team\",2)&\"P\")&IF(AI29=\"\",\"\",GETPIVOTDATA(\"Count of Match\",Pivots!$B$3,\"Player2\",$AD29,\"Team\",3)&\"M\")","v":""},{"$f":"IF(AD29=\"\",\"\",GETPIVOTDATA(\"Sum of Relative\",Pivots!$B$3,\"Player2\",$AD29)/GETPIVOTDATA(\"Count of Match\",Pivots!$B$3,\"Player2\",$AD29))","v":""},{"$f":"IFERROR(GETPIVOTDATA(\"Sum of Relative\",Pivots!$B$3,\"Player2\",$AD29,\"Team\",AG$4)/GETPIVOTDATA(\"Count of Match\",Pivots!$B$3,\"Player2\",$AD29,\"Team\",AG$4),\"\")","v":""},{"$f":"IFERROR(GETPIVOTDATA(\"Sum of Relative\",Pivots!$B$3,\"Player2\",$AD29,\"Team\",AH$4)/GETPIVOTDATA(\"Count of Match\",Pivots!$B$3,\"Player2\",$AD29,\"Team\",AH$4),\"\")","v":""},{"$f":"IFERROR(GETPIVOTDATA(\"Sum of Relative\",Pivots!$B$3,\"Player2\",$AD29,\"Team\",AI$4)/GETPIVOTDATA(\"Count of Match\",Pivots!$B$3,\"Player2\",$AD29,\"Team\",AI$4),\"\")","v":""},"",null,"",null,{"$f":"IF(AP29=\"\",\"\",GETPIVOTDATA(\"Count of Match\",Pivots!$B$3,\"Player2\",$AM29,\"Team\",1)&\"D\")&IF(AQ29=\"\",\"\",GETPIVOTDATA(\"Count of Match\",Pivots!$B$3,\"Player2\",$AM29,\"Team\",2)&\"P\")&IF(AR29=\"\",\"\",GETPIVOTDATA(\"Count of Match\",Pivots!$B$3,\"Player2\",$AM29,\"Team\",3)&\"M\")","v":""},{"$f":"IF(AM29=\"\",\"\",GETPIVOTDATA(\"Sum of Relative\",Pivots!$B$3,\"Player2\",$AM29)/GETPIVOTDATA(\"Count of Match\",Pivots!$B$3,\"Player2\",$AM29))","v":""},{"$f":"IFERROR(GETPIVOTDATA(\"Sum of Relative\",Pivots!$B$3,\"Player2\",$AM29,\"Team\",AP$4)/GETPIVOTDATA(\"Count of Match\",Pivots!$B$3,\"Player2\",$AM29,\"Team\",AP$4),\"\")","v":""},{"$f":"IFERROR(GETPIVOTDATA(\"Sum of Relative\",Pivots!$B$3,\"Player2\",$AM29,\"Team\",AQ$4)/GETPIVOTDATA(\"Count of Match\",Pivots!$B$3,\"Player2\",$AM29,\"Team\",AQ$4),\"\")","v":""},{"$f":"IFERROR(GETPIVOTDATA(\"Sum of Relative\",Pivots!$B$3,\"Player2\",$AM29,\"Team\",AR$4)/GETPIVOTDATA(\"Count of Match\",Pivots!$B$3,\"Player2\",$AM29,\"Team\",AR$4),\"\")","v":""},"",null,"",null,{"$f":"IF(AY29=\"\",\"\",GETPIVOTDATA(\"Count of Match\",Pivots!$B$3,\"Player2\",$AV29,\"Team\",1)&\"D\")&IF(AZ29=\"\",\"\",GETPIVOTDATA(\"Count of Match\",Pivots!$B$3,\"Player2\",$AV29,\"Team\",2)&\"P\")&IF(BA29=\"\",\"\",GETPIVOTDATA(\"Count of Match\",Pivots!$B$3,\"Player2\",$AV29,\"Team\",3)&\"M\")","v":""},{"$f":"IF(AV29=\"\",\"\",GETPIVOTDATA(\"Sum of Relative\",Pivots!$B$3,\"Player2\",$AV29)/GETPIVOTDATA(\"Count of Match\",Pivots!$B$3,\"Player2\",$AV29))","v":""},{"$f":"IFERROR(GETPIVOTDATA(\"Sum of Relative\",Pivots!$B$3,\"Player2\",$AV29,\"Team\",AY$4)/GETPIVOTDATA(\"Count of Match\",Pivots!$B$3,\"Player2\",$AV29,\"Team\",AY$4),\"\")","v":""},{"$f":"IFERROR(GETPIVOTDATA(\"Sum of Relative\",Pivots!$B$3,\"Player2\",$AV29,\"Team\",AZ$4)/GETPIVOTDATA(\"Count of Match\",Pivots!$B$3,\"Player2\",$AV29,\"Team\",AZ$4),\"\")","v":""},{"$f":"IFERROR(GETPIVOTDATA(\"Sum of Relative\",Pivots!$B$3,\"Player2\",$AV29,\"Team\",BA$4)/GETPIVOTDATA(\"Count of Match\",Pivots!$B$3,\"Player2\",$AV29,\"Team\",BA$4),\"\")","v":""},""]
[null,null,null,null,null,null,null,null,null,{"$f":"Pivots!AH57","v":0},{"$f":"IFERROR(VLOOKUP(J30,Tables!$F$2:$H$40,2),\"\")","v":""},{"$f":"Pivots!AI58","v":0},{"$f":"IF(J30=0,\"\",GETPIVOTDATA(\"Average of Team\",Pivots!AH30,\"Match\",$J30,\"player2\",$L30))","v":""},{"$f":"IF(J30=0,\"\",GETPIVOTDATA(\"Sum of Butler\",Pivots!AI30,\"Match\",$J30,\"player2\",$L30))","v":""},{"$f":"IF(J30=0,\"\",GETPIVOTDATA(\"Sum of MatchS\",Pivots!AJ30,\"Match\",$J30,\"player2\",$L30))","v":""},{"$f":"IF(J30=0,\"\",GETPIVOTDATA(\"Sum of Relative\",Pivots!AK30,\"Match\",$J30,\"player2\",$L30))","v":""},null,null,"GW",1,{"$f":"IFERROR(GETPIVOTDATA(\"Count of Match\",Pivots!B$3,\"Player2\",S30),\"\")","v":10},null,null,null,"PPH",2,9,null,"",null,{"$f":"IF(AG30=\"\",\"\",GETPIVOTDATA(\"Count of Match\",Pivots!$B$3,\"Player2\",$AD30,\"Team\",1)&\"D\")&IF(AH30=\"\",\"\",GETPIVOTDATA(\"Count of Match\",Pivots!$B$3,\"Player2\",$AD30,\"Team\",2)&\"P\")&IF(AI30=\"\",\"\",GETPIVOTDATA(\"Count of Match\",Pivots!$B$3,\"Player2\",$AD30,\"Team\",3)&\"M\")","v":""},{"$f":"IF(AD30=\"\",\"\",GETPIVOTDATA(\"Sum of Relative\",Pivots!$B$3,\"Player2\",$AD30)/GETPIVOTDATA(\"Count of Match\",Pivots!$B$3,\"Player2\",$AD30))","v":""},{"$f":"IFERROR(GETPIVOTDATA(\"Sum of Relative\",Pivots!$B$3,\"Player2\",$AD30,\"Team\",AG$4)/GETPIVOTDATA(\"Count of Match\",Pivots!$B$3,\"Player2\",$AD30,\"Team\",AG$4),\"\")","v":""},{"$f":"IFERROR(GETPIVOTDATA(\"Sum of Relative\",Pivots!$B$3,\"Player2\",$AD30,\"Team\",AH$4)/GETPIVOTDATA(\"Count of Match\",Pivots!$B$3,\"Player2\",$AD30,\"Team\",AH$4),\"\")","v":""},{"$f":"IFERROR(GETPIVOTDATA(\"Sum of Relative\",Pivots!$B$3,\"Player2\",$AD30,\"Team\",AI$4)/GETPIVOTDATA(\"Count of Match\",Pivots!$B$3,\"Player2\",$AD30,\"Team\",AI$4),\"\")","v":""},"",null,"",null,{"$f":"IF(AP30=\"\",\"\",GETPIVOTDATA(\"Count of Match\",Pivots!$B$3,\"Player2\",$AM30,\"Team\",1)&\"D\")&IF(AQ30=\"\",\"\",GETPIVOTDATA(\"Count of Match\",Pivots!$B$3,\"Player2\",$AM30,\"Team\",2)&\"P\")&IF(AR30=\"\",\"\",GETPIVOTDATA(\"Count of Match\",Pivots!$B$3,\"Player2\",$AM30,\"Team\",3)&\"M\")","v":""},{"$f":"IF(AM30=\"\",\"\",GETPIVOTDATA(\"Sum of Relative\",Pivots!$B$3,\"Player2\",$AM30)/GETPIVOTDATA(\"Count of Match\",Pivots!$B$3,\"Player2\",$AM30))","v":""},{"$f":"IFERROR(GETPIVOTDATA(\"Sum of Relative\",Pivots!$B$3,\"Player2\",$AM30,\"Team\",AP$4)/GETPIVOTDATA(\"Count of Match\",Pivots!$B$3,\"Player2\",$AM30,\"Team\",AP$4),\"\")","v":""},{"$f":"IFERROR(GETPIVOTDATA(\"Sum of Relative\",Pivots!$B$3,\"Player2\",$AM30,\"Team\",AQ$4)/GETPIVOTDATA(\"Count of Match\",Pivots!$B$3,\"Player2\",$AM30,\"Team\",AQ$4),\"\")","v":""},{"$f":"IFERROR(GETPIVOTDATA(\"Sum of Relative\",Pivots!$B$3,\"Player2\",$AM30,\"Team\",AR$4)/GETPIVOTDATA(\"Count of Match\",Pivots!$B$3,\"Player2\",$AM30,\"Team\",AR$4),\"\")","v":""},"",null,"",null,{"$f":"IF(AY30=\"\",\"\",GETPIVOTDATA(\"Count of Match\",Pivots!$B$3,\"Player2\",$AV30,\"Team\",1)&\"D\")&IF(AZ30=\"\",\"\",GETPIVOTDATA(\"Count of Match\",Pivots!$B$3,\"Player2\",$AV30,\"Team\",2)&\"P\")&IF(BA30=\"\",\"\",GETPIVOTDATA(\"Count of Match\",Pivots!$B$3,\"Player2\",$AV30,\"Team\",3)&\"M\")","v":""},{"$f":"IF(AV30=\"\",\"\",GETPIVOTDATA(\"Sum of Relative\",Pivots!$B$3,\"Player2\",$AV30)/GETPIVOTDATA(\"Count of Match\",Pivots!$B$3,\"Player2\",$AV30))","v":""},{"$f":"IFERROR(GETPIVOTDATA(\"Sum of Relative\",Pivots!$B$3,\"Player2\",$AV30,\"Team\",AY$4)/GETPIVOTDATA(\"Count of Match\",Pivots!$B$3,\"Player2\",$AV30,\"Team\",AY$4),\"\")","v":""},{"$f":"IFERROR(GETPIVOTDATA(\"Sum of Relative\",Pivots!$B$3,\"Player2\",$AV30,\"Team\",AZ$4)/GETPIVOTDATA(\"Count of Match\",Pivots!$B$3,\"Player2\",$AV30,\"Team\",AZ$4),\"\")","v":""},{"$f":"IFERROR(GETPIVOTDATA(\"Sum of Relative\",Pivots!$B$3,\"Player2\",$AV30,\"Team\",BA$4)/GETPIVOTDATA(\"Count of Match\",Pivots!$B$3,\"Player2\",$AV30,\"Team\",BA$4),\"\")","v":""},""]
[null,null,null,null,null,null,null,null,null,{"$f":"Pivots!AH59","v":0},{"$f":"IFERROR(VLOOKUP(J31,Tables!$F$2:$H$40,2),\"\")","v":""},{"$f":"Pivots!AI60","v":0},{"$f":"IF(J31=0,\"\",GETPIVOTDATA(\"Average of Team\",Pivots!AH31,\"Match\",$J31,\"player2\",$L31))","v":""},{"$f":"IF(J31=0,\"\",GETPIVOTDATA(\"Sum of Butler\",Pivots!AI31,\"Match\",$J31,\"player2\",$L31))","v":""},{"$f":"IF(J31=0,\"\",GETPIVOTDATA(\"Sum of MatchS\",Pivots!AJ31,\"Match\",$J31,\"player2\",$L31))","v":""},{"$f":"IF(J31=0,\"\",GETPIVOTDATA(\"Sum of Relative\",Pivots!AK31,\"Match\",$J31,\"player2\",$L31))","v":""},null,null,"HF",3,{"$f":"IFERROR(GETPIVOTDATA(\"Count of Match\",Pivots!B$3,\"Player2\",S31),\"\")","v":""},null,null,null,"PSH",1,10,null,"",null,{"$f":"IF(AG31=\"\",\"\",GETPIVOTDATA(\"Count of Match\",Pivots!$B$3,\"Player2\",$AD31,\"Team\",1)&\"D\")&IF(AH31=\"\",\"\",GETPIVOTDATA(\"Count of Match\",Pivots!$B$3,\"Player2\",$AD31,\"Team\",2)&\"P\")&IF(AI31=\"\",\"\",GETPIVOTDATA(\"Count of Match\",Pivots!$B$3,\"Player2\",$AD31,\"Team\",3)&\"M\")","v":""},{"$f":"IF(AD31=\"\",\"\",GETPIVOTDATA(\"Sum of Relative\",Pivots!$B$3,\"Player2\",$AD31)/GETPIVOTDATA(\"Count of Match\",Pivots!$B$3,\"Player2\",$AD31))","v":""},{"$f":"IFERROR(GETPIVOTDATA(\"Sum of Relative\",Pivots!$B$3,\"Player2\",$AD31,\"Team\",AG$4)/GETPIVOTDATA(\"Count of Match\",Pivots!$B$3,\"Player2\",$AD31,\"Team\",AG$4),\"\")","v":""},{"$f":"IFERROR(GETPIVOTDATA(\"Sum of Relative\",Pivots!$B$3,\"Player2\",$AD31,\"Team\",AH$4)/GETPIVOTDATA(\"Count of Match\",Pivots!$B$3,\"Player2\",$AD31,\"Team\",AH$4),\"\")","v":""},{"$f":"IFERROR(GETPIVOTDATA(\"Sum of Relative\",Pivots!$B$3,\"Player2\",$AD31,\"Team\",AI$4)/GETPIVOTDATA(\"Count of Match\",Pivots!$B$3,\"Player2\",$AD31,\"Team\",AI$4),\"\")","v":""},"",null,"",null,{"$f":"IF(AP31=\"\",\"\",GETPIVOTDATA(\"Count of Match\",Pivots!$B$3,\"Player2\",$AM31,\"Team\",1)&\"D\")&IF(AQ31=\"\",\"\",GETPIVOTDATA(\"Count of Match\",Pivots!$B$3,\"Player2\",$AM31,\"Team\",2)&\"P\")&IF(AR31=\"\",\"\",GETPIVOTDATA(\"Count of Match\",Pivots!$B$3,\"Player2\",$AM31,\"Team\",3)&\"M\")","v":""},{"$f":"IF(AM31=\"\",\"\",GETPIVOTDATA(\"Sum of Relative\",Pivots!$B$3,\"Player2\",$AM31)/GETPIVOTDATA(\"Count of Match\",Pivots!$B$3,\"Player2\",$AM31))","v":""},{"$f":"IFERROR(GETPIVOTDATA(\"Sum of Relative\",Pivots!$B$3,\"Player2\",$AM31,\"Team\",AP$4)/GETPIVOTDATA(\"Count of Match\",Pivots!$B$3,\"Player2\",$AM31,\"Team\",AP$4),\"\")","v":""},{"$f":"IFERROR(GETPIVOTDATA(\"Sum of Relative\",Pivots!$B$3,\"Player2\",$AM31,\"Team\",AQ$4)/GETPIVOTDATA(\"Count of Match\",Pivots!$B$3,\"Player2\",$AM31,\"Team\",AQ$4),\"\")","v":""},{"$f":"IFERROR(GETPIVOTDATA(\"Sum of Relative\",Pivots!$B$3,\"Player2\",$AM31,\"Team\",AR$4)/GETPIVOTDATA(\"Count of Match\",Pivots!$B$3,\"Player2\",$AM31,\"Team\",AR$4),\"\")","v":""},"",null,"",null,{"$f":"IF(AY31=\"\",\"\",GETPIVOTDATA(\"Count of Match\",Pivots!$B$3,\"Player2\",$AV31,\"Team\",1)&\"D\")&IF(AZ31=\"\",\"\",GETPIVOTDATA(\"Count of Match\",Pivots!$B$3,\"Player2\",$AV31,\"Team\",2)&\"P\")&IF(BA31=\"\",\"\",GETPIVOTDATA(\"Count of Match\",Pivots!$B$3,\"Player2\",$AV31,\"Team\",3)&\"M\")","v":""},{"$f":"IF(AV31=\"\",\"\",GETPIVOTDATA(\"Sum of Relative\",Pivots!$B$3,\"Player2\",$AV31)/GETPIVOTDATA(\"Count of Match\",Pivots!$B$3,\"Player2\",$AV31))","v":""},{"$f":"IFERROR(GETPIVOTDATA(\"Sum of Relative\",Pivots!$B$3,\"Player2\",$AV31,\"Team\",AY$4)/GETPIVOTDATA(\"Count of Match\",Pivots!$B$3,\"Player2\",$AV31,\"Team\",AY$4),\"\")","v":""},{"$f":"IFERROR(GETPIVOTDATA(\"Sum of Relative\",Pivots!$B$3,\"Player2\",$AV31,\"Team\",AZ$4)/GETPIVOTDATA(\"Count of Match\",Pivots!$B$3,\"Player2\",$AV31,\"Team\",AZ$4),\"\")","v":""},{"$f":"IFERROR(GETPIVOTDATA(\"Sum of Relative\",Pivots!$B$3,\"Player2\",$AV31,\"Team\",BA$4)/GETPIVOTDATA(\"Count of Match\",Pivots!$B$3,\"Player2\",$AV31,\"Team\",BA$4),\"\")","v":""},""]
[null,null,null,null,null,null,null,null,null,{"$f":"Pivots!AH61","v":0},{"$f":"IFERROR(VLOOKUP(J32,Tables!$F$2:$H$40,2),\"\")","v":""},{"$f":"Pivots!AI62","v":0},{"$f":"IF(J32=0,\"\",GETPIVOTDATA(\"Average of Team\",Pivots!AH32,\"Match\",$J32,\"player2\",$L32))","v":""},{"$f":"IF(J32=0,\"\",GETPIVOTDATA(\"Sum of Butler\",Pivots!AI32,\"Match\",$J32,\"player2\",$L32))","v":""},{"$f":"IF(J32=0,\"\",GETPIVOTDATA(\"Sum of MatchS\",Pivots!AJ32,\"Match\",$J32,\"player2\",$L32))","v":""},{"$f":"IF(J32=0,\"\",GETPIVOTDATA(\"Sum of Relative\",Pivots!AK32,\"Match\",$J32,\"player2\",$L32))","v":""},null,null,"IC",3,{"$f":"IFERROR(GETPIVOTDATA(\"Count of Match\",Pivots!B$3,\"Player2\",S32),\"\")","v":""},null,null,null,"PSW",2,9,null,"",null,{"$f":"IF(AG32=\"\",\"\",GETPIVOTDATA(\"Count of Match\",Pivots!$B$3,\"Player2\",$AD32,\"Team\",1)&\"D\")&IF(AH32=\"\",\"\",GETPIVOTDATA(\"Count of Match\",Pivots!$B$3,\"Player2\",$AD32,\"Team\",2)&\"P\")&IF(AI32=\"\",\"\",GETPIVOTDATA(\"Count of Match\",Pivots!$B$3,\"Player2\",$AD32,\"Team\",3)&\"M\")","v":""},{"$f":"IF(AD32=\"\",\"\",GETPIVOTDATA(\"Sum of Relative\",Pivots!$B$3,\"Player2\",$AD32)/GETPIVOTDATA(\"Count of Match\",Pivots!$B$3,\"Player2\",$AD32))","v":""},{"$f":"IFERROR(GETPIVOTDATA(\"Sum of Relative\",Pivots!$B$3,\"Player2\",$AD32,\"Team\",AG$4)/GETPIVOTDATA(\"Count of Match\",Pivots!$B$3,\"Player2\",$AD32,\"Team\",AG$4),\"\")","v":""},{"$f":"IFERROR(GETPIVOTDATA(\"Sum of Relative\",Pivots!$B$3,\"Player2\",$AD32,\"Team\",AH$4)/GETPIVOTDATA(\"Count of Match\",Pivots!$B$3,\"Player2\",$AD32,\"Team\",AH$4),\"\")","v":""},{"$f":"IFERROR(GETPIVOTDATA(\"Sum of Relative\",Pivots!$B$3,\"Player2\",$AD32,\"Team\",AI$4)/GETPIVOTDATA(\"Count of Match\",Pivots!$B$3,\"Player2\",$AD32,\"Team\",AI$4),\"\")","v":""},"",null,"",null,{"$f":"IF(AP32=\"\",\"\",GETPIVOTDATA(\"Count of Match\",Pivots!$B$3,\"Player2\",$AM32,\"Team\",1)&\"D\")&IF(AQ32=\"\",\"\",GETPIVOTDATA(\"Count of Match\",Pivots!$B$3,\"Player2\",$AM32,\"Team\",2)&\"P\")&IF(AR32=\"\",\"\",GETPIVOTDATA(\"Count of Match\",Pivots!$B$3,\"Player2\",$AM32,\"Team\",3)&\"M\")","v":""},{"$f":"IF(AM32=\"\",\"\",GETPIVOTDATA(\"Sum of Relative\",Pivots!$B$3,\"Player2\",$AM32)/GETPIVOTDATA(\"Count of Match\",Pivots!$B$3,\"Player2\",$AM32))","v":""},{"$f":"IFERROR(GETPIVOTDATA(\"Sum of Relative\",Pivots!$B$3,\"Player2\",$AM32,\"Team\",AP$4)/GETPIVOTDATA(\"Count of Match\",Pivots!$B$3,\"Player2\",$AM32,\"Team\",AP$4),\"\")","v":""},{"$f":"IFERROR(GETPIVOTDATA(\"Sum of Relative\",Pivots!$B$3,\"Player2\",$AM32,\"Team\",AQ$4)/GETPIVOTDATA(\"Count of Match\",Pivots!$B$3,\"Player2\",$AM32,\"Team\",AQ$4),\"\")","v":""},{"$f":"IFERROR(GETPIVOTDATA(\"Sum of Relative\",Pivots!$B$3,\"Player2\",$AM32,\"Team\",AR$4)/GETPIVOTDATA(\"Count of Match\",Pivots!$B$3,\"Player2\",$AM32,\"Team\",AR$4),\"\")","v":""},"",null,"",null,{"$f":"IF(AY32=\"\",\"\",GETPIVOTDATA(\"Count of Match\",Pivots!$B$3,\"Player2\",$AV32,\"Team\",1)&\"D\")&IF(AZ32=\"\",\"\",GETPIVOTDATA(\"Count of Match\",Pivots!$B$3,\"Player2\",$AV32,\"Team\",2)&\"P\")&IF(BA32=\"\",\"\",GETPIVOTDATA(\"Count of Match\",Pivots!$B$3,\"Player2\",$AV32,\"Team\",3)&\"M\")","v":""},{"$f":"IF(AV32=\"\",\"\",GETPIVOTDATA(\"Sum of Relative\",Pivots!$B$3,\"Player2\",$AV32)/GETPIVOTDATA(\"Count of Match\",Pivots!$B$3,\"Player2\",$AV32))","v":""},{"$f":"IFERROR(GETPIVOTDATA(\"Sum of Relative\",Pivots!$B$3,\"Player2\",$AV32,\"Team\",AY$4)/GETPIVOTDATA(\"Count of Match\",Pivots!$B$3,\"Player2\",$AV32,\"Team\",AY$4),\"\")","v":""},{"$f":"IFERROR(GETPIVOTDATA(\"Sum of Relative\",Pivots!$B$3,\"Player2\",$AV32,\"Team\",AZ$4)/GETPIVOTDATA(\"Count of Match\",Pivots!$B$3,\"Player2\",$AV32,\"Team\",AZ$4),\"\")","v":""},{"$f":"IFERROR(GETPIVOTDATA(\"Sum of Relative\",Pivots!$B$3,\"Player2\",$AV32,\"Team\",BA$4)/GETPIVOTDATA(\"Count of Match\",Pivots!$B$3,\"Player2\",$AV32,\"Team\",BA$4),\"\")","v":""},""]
[null,null,null,null,null,null,null,null,null,{"$f":"Pivots!AH63","v":0},{"$f":"IFERROR(VLOOKUP(J33,Tables!$F$2:$H$40,2),\"\")","v":""},{"$f":"Pivots!AI64","v":0},{"$f":"IF(J33=0,\"\",GETPIVOTDATA(\"Average of Team\",Pivots!AH33,\"Match\",$J33,\"player2\",$L33))","v":""},{"$f":"IF(J33=0,\"\",GETPIVOTDATA(\"Sum of Butler\",Pivots!AI33,\"Match\",$J33,\"player2\",$L33))","v":""},{"$f":"IF(J33=0,\"\",GETPIVOTDATA(\"Sum of MatchS\",Pivots!AJ33,\"Match\",$J33,\"player2\",$L33))","v":""},{"$f":"IF(J33=0,\"\",GETPIVOTDATA(\"Sum of Relative\",Pivots!AK33,\"Match\",$J33,\"player2\",$L33))","v":""},null,null,"JAN",1,{"$f":"IFERROR(GETPIVOTDATA(\"Count of Match\",Pivots!B$3,\"Player2\",S33),\"\")","v":9},null,null,null,"PW",3,12,null,"",null,{"$f":"IF(AG33=\"\",\"\",GETPIVOTDATA(\"Count of Match\",Pivots!$B$3,\"Player2\",$AD33,\"Team\",1)&\"D\")&IF(AH33=\"\",\"\",GETPIVOTDATA(\"Count of Match\",Pivots!$B$3,\"Player2\",$AD33,\"Team\",2)&\"P\")&IF(AI33=\"\",\"\",GETPIVOTDATA(\"Count of Match\",Pivots!$B$3,\"Player2\",$AD33,\"Team\",3)&\"M\")","v":""},{"$f":"IF(AD33=\"\",\"\",GETPIVOTDATA(\"Sum of Relative\",Pivots!$B$3,\"Player2\",$AD33)/GETPIVOTDATA(\"Count of Match\",Pivots!$B$3,\"Player2\",$AD33))","v":""},{"$f":"IFERROR(GETPIVOTDATA(\"Sum of Relative\",Pivots!$B$3,\"Player2\",$AD33,\"Team\",AG$4)/GETPIVOTDATA(\"Count of Match\",Pivots!$B$3,\"Player2\",$AD33,\"Team\",AG$4),\"\")","v":""},{"$f":"IFERROR(GETPIVOTDATA(\"Sum of Relative\",Pivots!$B$3,\"Player2\",$AD33,\"Team\",AH$4)/GETPIVOTDATA(\"Count of Match\",Pivots!$B$3,\"Player2\",$AD33,\"Team\",AH$4),\"\")","v":""},{"$f":"IFERROR(GETPIVOTDATA(\"Sum of Relative\",Pivots!$B$3,\"Player2\",$AD33,\"Team\",AI$4)/GETPIVOTDATA(\"Count of Match\",Pivots!$B$3,\"Player2\",$AD33,\"Team\",AI$4),\"\")","v":""},"",null,"",null,{"$f":"IF(AP33=\"\",\"\",GETPIVOTDATA(\"Count of Match\",Pivots!$B$3,\"Player2\",$AM33,\"Team\",1)&\"D\")&IF(AQ33=\"\",\"\",GETPIVOTDATA(\"Count of Match\",Pivots!$B$3,\"Player2\",$AM33,\"Team\",2)&\"P\")&IF(AR33=\"\",\"\",GETPIVOTDATA(\"Count of Match\",Pivots!$B$3,\"Player2\",$AM33,\"Team\",3)&\"M\")","v":""},{"$f":"IF(AM33=\"\",\"\",GETPIVOTDATA(\"Sum of Relative\",Pivots!$B$3,\"Player2\",$AM33)/GETPIVOTDATA(\"Count of Match\",Pivots!$B$3,\"Player2\",$AM33))","v":""},{"$f":"IFERROR(GETPIVOTDATA(\"Sum of Relative\",Pivots!$B$3,\"Player2\",$AM33,\"Team\",AP$4)/GETPIVOTDATA(\"Count of Match\",Pivots!$B$3,\"Player2\",$AM33,\"Team\",AP$4),\"\")","v":""},{"$f":"IFERROR(GETPIVOTDATA(\"Sum of Relative\",Pivots!$B$3,\"Player2\",$AM33,\"Team\",AQ$4)/GETPIVOTDATA(\"Count of Match\",Pivots!$B$3,\"Player2\",$AM33,\"Team\",AQ$4),\"\")","v":""},{"$f":"IFERROR(GETPIVOTDATA(\"Sum of Relative\",Pivots!$B$3,\"Player2\",$AM33,\"Team\",AR$4)/GETPIVOTDATA(\"Count of Match\",Pivots!$B$3,\"Player2\",$AM33,\"Team\",AR$4),\"\")","v":""},"",null,"",null,{"$f":"IF(AY33=\"\",\"\",GETPIVOTDATA(\"Count of Match\",Pivots!$B$3,\"Player2\",$AV33,\"Team\",1)&\"D\")&IF(AZ33=\"\",\"\",GETPIVOTDATA(\"Count of Match\",Pivots!$B$3,\"Player2\",$AV33,\"Team\",2)&\"P\")&IF(BA33=\"\",\"\",GETPIVOTDATA(\"Count of Match\",Pivots!$B$3,\"Player2\",$AV33,\"Team\",3)&\"M\")","v":""},{"$f":"IF(AV33=\"\",\"\",GETPIVOTDATA(\"Sum of Relative\",Pivots!$B$3,\"Player2\",$AV33)/GETPIVOTDATA(\"Count of Match\",Pivots!$B$3,\"Player2\",$AV33))","v":""},{"$f":"IFERROR(GETPIVOTDATA(\"Sum of Relative\",Pivots!$B$3,\"Player2\",$AV33,\"Team\",AY$4)/GETPIVOTDATA(\"Count of Match\",Pivots!$B$3,\"Player2\",$AV33,\"Team\",AY$4),\"\")","v":""},{"$f":"IFERROR(GETPIVOTDATA(\"Sum of Relative\",Pivots!$B$3,\"Player2\",$AV33,\"Team\",AZ$4)/GETPIVOTDATA(\"Count of Match\",Pivots!$B$3,\"Player2\",$AV33,\"Team\",AZ$4),\"\")","v":""},{"$f":"IFERROR(GETPIVOTDATA(\"Sum of Relative\",Pivots!$B$3,\"Player2\",$AV33,\"Team\",BA$4)/GETPIVOTDATA(\"Count of Match\",Pivots!$B$3,\"Player2\",$AV33,\"Team\",BA$4),\"\")","v":""},""]
[null,null,null,null,null,null,null,null,null,{"$f":"Pivots!AH65","v":0},{"$f":"IFERROR(VLOOKUP(J34,Tables!$F$2:$H$40,2),\"\")","v":""},{"$f":"Pivots!AI66","v":0},{"$f":"IF(J34=0,\"\",GETPIVOTDATA(\"Average of Team\",Pivots!AH34,\"Match\",$J34,\"player2\",$L34))","v":""},{"$f":"IF(J34=0,\"\",GETPIVOTDATA(\"Sum of Butler\",Pivots!AI34,\"Match\",$J34,\"player2\",$L34))","v":""},{"$f":"IF(J34=0,\"\",GETPIVOTDATA(\"Sum of MatchS\",Pivots!AJ34,\"Match\",$J34,\"player2\",$L34))","v":""},{"$f":"IF(J34=0,\"\",GETPIVOTDATA(\"Sum of Relative\",Pivots!AK34,\"Match\",$J34,\"player2\",$L34))","v":""},null,null,"JAR",2,{"$f":"IFERROR(GETPIVOTDATA(\"Count of Match\",Pivots!B$3,\"Player2\",S34),\"\")","v":5},null,null,null,"RB",1,11,null,"",null,{"$f":"IF(AG34=\"\",\"\",GETPIVOTDATA(\"Count of Match\",Pivots!$B$3,\"Player2\",$AD34,\"Team\",1)&\"D\")&IF(AH34=\"\",\"\",GETPIVOTDATA(\"Count of Match\",Pivots!$B$3,\"Player2\",$AD34,\"Team\",2)&\"P\")&IF(AI34=\"\",\"\",GETPIVOTDATA(\"Count of Match\",Pivots!$B$3,\"Player2\",$AD34,\"Team\",3)&\"M\")","v":""},{"$f":"IF(AD34=\"\",\"\",GETPIVOTDATA(\"Sum of Relative\",Pivots!$B$3,\"Player2\",$AD34)/GETPIVOTDATA(\"Count of Match\",Pivots!$B$3,\"Player2\",$AD34))","v":""},{"$f":"IFERROR(GETPIVOTDATA(\"Sum of Relative\",Pivots!$B$3,\"Player2\",$AD34,\"Team\",AG$4)/GETPIVOTDATA(\"Count of Match\",Pivots!$B$3,\"Player2\",$AD34,\"Team\",AG$4),\"\")","v":""},{"$f":"IFERROR(GETPIVOTDATA(\"Sum of Relative\",Pivots!$B$3,\"Player2\",$AD34,\"Team\",AH$4)/GETPIVOTDATA(\"Count of Match\",Pivots!$B$3,\"Player2\",$AD34,\"Team\",AH$4),\"\")","v":""},{"$f":"IFERROR(GETPIVOTDATA(\"Sum of Relative\",Pivots!$B$3,\"Player2\",$AD34,\"Team\",AI$4)/GETPIVOTDATA(\"Count of Match\",Pivots!$B$3,\"Player2\",$AD34,\"Team\",AI$4),\"\")","v":""},"",null,"",null,{"$f":"IF(AP34=\"\",\"\",GETPIVOTDATA(\"Count of Match\",Pivots!$B$3,\"Player2\",$AM34,\"Team\",1)&\"D\")&IF(AQ34=\"\",\"\",GETPIVOTDATA(\"Count of Match\",Pivots!$B$3,\"Player2\",$AM34,\"Team\",2)&\"P\")&IF(AR34=\"\",\"\",GETPIVOTDATA(\"Count of Match\",Pivots!$B$3,\"Player2\",$AM34,\"Team\",3)&\"M\")","v":""},{"$f":"IF(AM34=\"\",\"\",GETPIVOTDATA(\"Sum of Relative\",Pivots!$B$3,\"Player2\",$AM34)/GETPIVOTDATA(\"Count of Match\",Pivots!$B$3,\"Player2\",$AM34))","v":""},{"$f":"IFERROR(GETPIVOTDATA(\"Sum of Relative\",Pivots!$B$3,\"Player2\",$AM34,\"Team\",AP$4)/GETPIVOTDATA(\"Count of Match\",Pivots!$B$3,\"Player2\",$AM34,\"Team\",AP$4),\"\")","v":""},{"$f":"IFERROR(GETPIVOTDATA(\"Sum of Relative\",Pivots!$B$3,\"Player2\",$AM34,\"Team\",AQ$4)/GETPIVOTDATA(\"Count of Match\",Pivots!$B$3,\"Player2\",$AM34,\"Team\",AQ$4),\"\")","v":""},{"$f":"IFERROR(GETPIVOTDATA(\"Sum of Relative\",Pivots!$B$3,\"Player2\",$AM34,\"Team\",AR$4)/GETPIVOTDATA(\"Count of Match\",Pivots!$B$3,\"Player2\",$AM34,\"Team\",AR$4),\"\")","v":""},"",null,"",null,{"$f":"IF(AY34=\"\",\"\",GETPIVOTDATA(\"Count of Match\",Pivots!$B$3,\"Player2\",$AV34,\"Team\",1)&\"D\")&IF(AZ34=\"\",\"\",GETPIVOTDATA(\"Count of Match\",Pivots!$B$3,\"Player2\",$AV34,\"Team\",2)&\"P\")&IF(BA34=\"\",\"\",GETPIVOTDATA(\"Count of Match\",Pivots!$B$3,\"Player2\",$AV34,\"Team\",3)&\"M\")","v":""},{"$f":"IF(AV34=\"\",\"\",GETPIVOTDATA(\"Sum of Relative\",Pivots!$B$3,\"Player2\",$AV34)/GETPIVOTDATA(\"Count of Match\",Pivots!$B$3,\"Player2\",$AV34))","v":""},{"$f":"IFERROR(GETPIVOTDATA(\"Sum of Relative\",Pivots!$B$3,\"Player2\",$AV34,\"Team\",AY$4)/GETPIVOTDATA(\"Count of Match\",Pivots!$B$3,\"Player2\",$AV34,\"Team\",AY$4),\"\")","v":""},{"$f":"IFERROR(GETPIVOTDATA(\"Sum of Relative\",Pivots!$B$3,\"Player2\",$AV34,\"Team\",AZ$4)/GETPIVOTDATA(\"Count of Match\",Pivots!$B$3,\"Player2\",$AV34,\"Team\",AZ$4),\"\")","v":""},{"$f":"IFERROR(GETPIVOTDATA(\"Sum of Relative\",Pivots!$B$3,\"Player2\",$AV34,\"Team\",BA$4)/GETPIVOTDATA(\"Count of Match\",Pivots!$B$3,\"Player2\",$AV34,\"Team\",BA$4),\"\")","v":""},""]
[null,null,null,null,null,null,null,null,null,{"$f":"Pivots!AH67","v":0},{"$f":"IFERROR(VLOOKUP(J35,Tables!$F$2:$H$40,2),\"\")","v":""},{"$f":"Pivots!AI68","v":0},{"$f":"IF(J35=0,\"\",GETPIVOTDATA(\"Average of Team\",Pivots!AH35,\"Match\",$J35,\"player2\",$L35))","v":""},{"$f":"IF(J35=0,\"\",GETPIVOTDATA(\"Sum of Butler\",Pivots!AI35,\"Match\",$J35,\"player2\",$L35))","v":""},{"$f":"IF(J35=0,\"\",GETPIVOTDATA(\"Sum of MatchS\",Pivots!AJ35,\"Match\",$J35,\"player2\",$L35))","v":""},{"$f":"IF(J35=0,\"\",GETPIVOTDATA(\"Sum of Relative\",Pivots!AK35,\"Match\",$J35,\"player2\",$L35))","v":""},null,null,"JAT",1,{"$f":"IFERROR(GETPIVOTDATA(\"Count of Match\",Pivots!B$3,\"Player2\",S35),\"\")","v":4},null,null,null,"RCM",1,10,null,"",null,{"$f":"IF(AG35=\"\",\"\",GETPIVOTDATA(\"Count of Match\",Pivots!$B$3,\"Player2\",$AD35,\"Team\",1)&\"D\")&IF(AH35=\"\",\"\",GETPIVOTDATA(\"Count of Match\",Pivots!$B$3,\"Player2\",$AD35,\"Team\",2)&\"P\")&IF(AI35=\"\",\"\",GETPIVOTDATA(\"Count of Match\",Pivots!$B$3,\"Player2\",$AD35,\"Team\",3)&\"M\")","v":""},{"$f":"IF(AD35=\"\",\"\",GETPIVOTDATA(\"Sum of Relative\",Pivots!$B$3,\"Player2\",$AD35)/GETPIVOTDATA(\"Count of Match\",Pivots!$B$3,\"Player2\",$AD35))","v":""},{"$f":"IFERROR(GETPIVOTDATA(\"Sum of Relative\",Pivots!$B$3,\"Player2\",$AD35,\"Team\",AG$4)/GETPIVOTDATA(\"Count of Match\",Pivots!$B$3,\"Player2\",$AD35,\"Team\",AG$4),\"\")","v":""},{"$f":"IFERROR(GETPIVOTDATA(\"Sum of Relative\",Pivots!$B$3,\"Player2\",$AD35,\"Team\",AH$4)/GETPIVOTDATA(\"Count of Match\",Pivots!$B$3,\"Player2\",$AD35,\"Team\",AH$4),\"\")","v":""},{"$f":"IFERROR(GETPIVOTDATA(\"Sum of Relative\",Pivots!$B$3,\"Player2\",$AD35,\"Team\",AI$4)/GETPIVOTDATA(\"Count of Match\",Pivots!$B$3,\"Player2\",$AD35,\"Team\",AI$4),\"\")","v":""},"",null,"",null,{"$f":"IF(AP35=\"\",\"\",GETPIVOTDATA(\"Count of Match\",Pivots!$B$3,\"Player2\",$AM35,\"Team\",1)&\"D\")&IF(AQ35=\"\",\"\",GETPIVOTDATA(\"Count of Match\",Pivots!$B$3,\"Player2\",$AM35,\"Team\",2)&\"P\")&IF(AR35=\"\",\"\",GETPIVOTDATA(\"Count of Match\",Pivots!$B$3,\"Player2\",$AM35,\"Team\",3)&\"M\")","v":""},{"$f":"IF(AM35=\"\",\"\",GETPIVOTDATA(\"Sum of Relative\",Pivots!$B$3,\"Player2\",$AM35)/GETPIVOTDATA(\"Count of Match\",Pivots!$B$3,\"Player2\",$AM35))","v":""},{"$f":"IFERROR(GETPIVOTDATA(\"Sum of Relative\",Pivots!$B$3,\"Player2\",$AM35,\"Team\",AP$4)/GETPIVOTDATA(\"Count of Match\",Pivots!$B$3,\"Player2\",$AM35,\"Team\",AP$4),\"\")","v":""},{"$f":"IFERROR(GETPIVOTDATA(\"Sum of Relative\",Pivots!$B$3,\"Player2\",$AM35,\"Team\",AQ$4)/GETPIVOTDATA(\"Count of Match\",Pivots!$B$3,\"Player2\",$AM35,\"Team\",AQ$4),\"\")","v":""},{"$f":"IFERROR(GETPIVOTDATA(\"Sum of Relative\",Pivots!$B$3,\"Player2\",$AM35,\"Team\",AR$4)/GETPIVOTDATA(\"Count of Match\",Pivots!$B$3,\"Player2\",$AM35,\"Team\",AR$4),\"\")","v":""},"",null,"",null,{"$f":"IF(AY35=\"\",\"\",GETPIVOTDATA(\"Count of Match\",Pivots!$B$3,\"Player2\",$AV35,\"Team\",1)&\"D\")&IF(AZ35=\"\",\"\",GETPIVOTDATA(\"Count of Match\",Pivots!$B$3,\"Player2\",$AV35,\"Team\",2)&\"P\")&IF(BA35=\"\",\"\",GETPIVOTDATA(\"Count of Match\",Pivots!$B$3,\"Player2\",$AV35,\"Team\",3)&\"M\")","v":""},{"$f":"IF(AV35=\"\",\"\",GETPIVOTDATA(\"Sum of Relative\",Pivots!$B$3,\"Player2\",$AV35)/GETPIVOTDATA(\"Count of Match\",Pivots!$B$3,\"Player2\",$AV35))","v":""},{"$f":"IFERROR(GETPIVOTDATA(\"Sum of Relative\",Pivots!$B$3,\"Player2\",$AV35,\"Team\",AY$4)/GETPIVOTDATA(\"Count of Match\",Pivots!$B$3,\"Player2\",$AV35,\"Team\",AY$4),\"\")","v":""},{"$f":"IFERROR(GETPIVOTDATA(\"Sum of Relative\",Pivots!$B$3,\"Player2\",$AV35,\"Team\",AZ$4)/GETPIVOTDATA(\"Count of Match\",Pivots!$B$3,\"Player2\",$AV35,\"Team\",AZ$4),\"\")","v":""},{"$f":"IFERROR(GETPIVOTDATA(\"Sum of Relative\",Pivots!$B$3,\"Player2\",$AV35,\"Team\",BA$4)/GETPIVOTDATA(\"Count of Match\",Pivots!$B$3,\"Player2\",$AV35,\"Team\",BA$4),\"\")","v":""},""]
[null,null,null,null,null,null,null,null,null,0,{"$f":"IFERROR(VLOOKUP(J36,Tables!$F$2:$H$40,2),\"\")","v":""},{"$f":"Pivots!AI70","v":0},{"$f":"IF(J36=0,\"\",GETPIVOTDATA(\"Average of Team\",Pivots!AH36,\"Match\",$J36,\"player2\",$L36))","v":""},{"$f":"IF(J36=0,\"\",GETPIVOTDATA(\"Sum of Butler\",Pivots!AI36,\"Match\",$J36,\"player2\",$L36))","v":""},{"$f":"IF(J36=0,\"\",GETPIVOTDATA(\"Sum of MatchS\",Pivots!AJ36,\"Match\",$J36,\"player2\",$L36))","v":""},{"$f":"IF(J36=0,\"\",GETPIVOTDATA(\"Sum of Relative\",Pivots!AK36,\"Match\",$J36,\"player2\",$L36))","v":""},null,null,"JC",2,{"$f":"IFERROR(GETPIVOTDATA(\"Count of Match\",Pivots!B$3,\"Player2\",S36),\"\")","v":9},null,null,null,"RCO",2,7,null,"",null,{"$f":"IF(AG36=\"\",\"\",GETPIVOTDATA(\"Count of Match\",Pivots!$B$3,\"Player2\",$AD36,\"Team\",1)&\"D\")&IF(AH36=\"\",\"\",GETPIVOTDATA(\"Count of Match\",Pivots!$B$3,\"Player2\",$AD36,\"Team\",2)&\"P\")&IF(AI36=\"\",\"\",GETPIVOTDATA(\"Count of Match\",Pivots!$B$3,\"Player2\",$AD36,\"Team\",3)&\"M\")","v":""},{"$f":"IF(AD36=\"\",\"\",GETPIVOTDATA(\"Sum of Relative\",Pivots!$B$3,\"Player2\",$AD36)/GETPIVOTDATA(\"Count of Match\",Pivots!$B$3,\"Player2\",$AD36))","v":""},{"$f":"IFERROR(GETPIVOTDATA(\"Sum of Relative\",Pivots!$B$3,\"Player2\",$AD36,\"Team\",AG$4)/GETPIVOTDATA(\"Count of Match\",Pivots!$B$3,\"Player2\",$AD36,\"Team\",AG$4),\"\")","v":""},{"$f":"IFERROR(GETPIVOTDATA(\"Sum of Relative\",Pivots!$B$3,\"Player2\",$AD36,\"Team\",AH$4)/GETPIVOTDATA(\"Count of Match\",Pivots!$B$3,\"Player2\",$AD36,\"Team\",AH$4),\"\")","v":""},{"$f":"IFERROR(GETPIVOTDATA(\"Sum of Relative\",Pivots!$B$3,\"Player2\",$AD36,\"Team\",AI$4)/GETPIVOTDATA(\"Count of Match\",Pivots!$B$3,\"Player2\",$AD36,\"Team\",AI$4),\"\")","v":""},"",null,"",null,{"$f":"IF(AP36=\"\",\"\",GETPIVOTDATA(\"Count of Match\",Pivots!$B$3,\"Player2\",$AM36,\"Team\",1)&\"D\")&IF(AQ36=\"\",\"\",GETPIVOTDATA(\"Count of Match\",Pivots!$B$3,\"Player2\",$AM36,\"Team\",2)&\"P\")&IF(AR36=\"\",\"\",GETPIVOTDATA(\"Count of Match\",Pivots!$B$3,\"Player2\",$AM36,\"Team\",3)&\"M\")","v":""},{"$f":"IF(AM36=\"\",\"\",GETPIVOTDATA(\"Sum of Relative\",Pivots!$B$3,\"Player2\",$AM36)/GETPIVOTDATA(\"Count of Match\",Pivots!$B$3,\"Player2\",$AM36))","v":""},{"$f":"IFERROR(GETPIVOTDATA(\"Sum of Relative\",Pivots!$B$3,\"Player2\",$AM36,\"Team\",AP$4)/GETPIVOTDATA(\"Count of Match\",Pivots!$B$3,\"Player2\",$AM36,\"Team\",AP$4),\"\")","v":""},{"$f":"IFERROR(GETPIVOTDATA(\"Sum of Relative\",Pivots!$B$3,\"Player2\",$AM36,\"Team\",AQ$4)/GETPIVOTDATA(\"Count of Match\",Pivots!$B$3,\"Player2\",$AM36,\"Team\",AQ$4),\"\")","v":""},{"$f":"IFERROR(GETPIVOTDATA(\"Sum of Relative\",Pivots!$B$3,\"Player2\",$AM36,\"Team\",AR$4)/GETPIVOTDATA(\"Count of Match\",Pivots!$B$3,\"Player2\",$AM36,\"Team\",AR$4),\"\")","v":""},"",null,"",null,{"$f":"IF(AY36=\"\",\"\",GETPIVOTDATA(\"Count of Match\",Pivots!$B$3,\"Player2\",$AV36,\"Team\",1)&\"D\")&IF(AZ36=\"\",\"\",GETPIVOTDATA(\"Count of Match\",Pivots!$B$3,\"Player2\",$AV36,\"Team\",2)&\"P\")&IF(BA36=\"\",\"\",GETPIVOTDATA(\"Count of Match\",Pivots!$B$3,\"Player2\",$AV36,\"Team\",3)&\"M\")","v":""},{"$f":"IF(AV36=\"\",\"\",GETPIVOTDATA(\"Sum of Relative\",Pivots!$B$3,\"Player2\",$AV36)/GETPIVOTDATA(\"Count of Match\",Pivots!$B$3,\"Player2\",$AV36))","v":""},{"$f":"IFERROR(GETPIVOTDATA(\"Sum of Relative\",Pivots!$B$3,\"Player2\",$AV36,\"Team\",AY$4)/GETPIVOTDATA(\"Count of Match\",Pivots!$B$3,\"Player2\",$AV36,\"Team\",AY$4),\"\")","v":""},{"$f":"IFERROR(GETPIVOTDATA(\"Sum of Relative\",Pivots!$B$3,\"Player2\",$AV36,\"Team\",AZ$4)/GETPIVOTDATA(\"Count of Match\",Pivots!$B$3,\"Player2\",$AV36,\"Team\",AZ$4),\"\")","v":""},{"$f":"IFERROR(GETPIVOTDATA(\"Sum of Relative\",Pivots!$B$3,\"Player2\",$AV36,\"Team\",BA$4)/GETPIVOTDATA(\"Count of Match\",Pivots!$B$3,\"Player2\",$AV36,\"Team\",BA$4),\"\")","v":""},""]
[null,null,null,null,null,null,null,null,null,null,{"$f":"IFERROR(VLOOKUP(J37,Tables!$F$2:$H$40,2),\"\")","v":""},null,null,null,null,null,null,null,"JSI",2,{"$f":"IFERROR(GETPIVOTDATA(\"Count of Match\",Pivots!B$3,\"Player2\",S37),\"\")","v":12},null,null,null,"RHA",3,9,null,"",null,{"$f":"IF(AG37=\"\",\"\",GETPIVOTDATA(\"Count of Match\",Pivots!$B$3,\"Player2\",$AD37,\"Team\",1)&\"D\")&IF(AH37=\"\",\"\",GETPIVOTDATA(\"Count of Match\",Pivots!$B$3,\"Player2\",$AD37,\"Team\",2)&\"P\")&IF(AI37=\"\",\"\",GETPIVOTDATA(\"Count of Match\",Pivots!$B$3,\"Player2\",$AD37,\"Team\",3)&\"M\")","v":""},{"$f":"IF(AD37=\"\",\"\",GETPIVOTDATA(\"Sum of Relative\",Pivots!$B$3,\"Player2\",$AD37)/GETPIVOTDATA(\"Count of Match\",Pivots!$B$3,\"Player2\",$AD37))","v":""},{"$f":"IFERROR(GETPIVOTDATA(\"Sum of Relative\",Pivots!$B$3,\"Player2\",$AD37,\"Team\",AG$4)/GETPIVOTDATA(\"Count of Match\",Pivots!$B$3,\"Player2\",$AD37,\"Team\",AG$4),\"\")","v":""},{"$f":"IFERROR(GETPIVOTDATA(\"Sum of Relative\",Pivots!$B$3,\"Player2\",$AD37,\"Team\",AH$4)/GETPIVOTDATA(\"Count of Match\",Pivots!$B$3,\"Player2\",$AD37,\"Team\",AH$4),\"\")","v":""},{"$f":"IFERROR(GETPIVOTDATA(\"Sum of Relative\",Pivots!$B$3,\"Player2\",$AD37,\"Team\",AI$4)/GETPIVOTDATA(\"Count of Match\",Pivots!$B$3,\"Player2\",$AD37,\"Team\",AI$4),\"\")","v":""},"",null,"",null,{"$f":"IF(AP37=\"\",\"\",GETPIVOTDATA(\"Count of Match\",Pivots!$B$3,\"Player2\",$AM37,\"Team\",1)&\"D\")&IF(AQ37=\"\",\"\",GETPIVOTDATA(\"Count of Match\",Pivots!$B$3,\"Player2\",$AM37,\"Team\",2)&\"P\")&IF(AR37=\"\",\"\",GETPIVOTDATA(\"Count of Match\",Pivots!$B$3,\"Player2\",$AM37,\"Team\",3)&\"M\")","v":""},{"$f":"IF(AM37=\"\",\"\",GETPIVOTDATA(\"Sum of Relative\",Pivots!$B$3,\"Player2\",$AM37)/GETPIVOTDATA(\"Count of Match\",Pivots!$B$3,\"Player2\",$AM37))","v":""},{"$f":"IFERROR(GETPIVOTDATA(\"Sum of Relative\",Pivots!$B$3,\"Player2\",$AM37,\"Team\",AP$4)/GETPIVOTDATA(\"Count of Match\",Pivots!$B$3,\"Player2\",$AM37,\"Team\",AP$4),\"\")","v":""},{"$f":"IFERROR(GETPIVOTDATA(\"Sum of Relative\",Pivots!$B$3,\"Player2\",$AM37,\"Team\",AQ$4)/GETPIVOTDATA(\"Count of Match\",Pivots!$B$3,\"Player2\",$AM37,\"Team\",AQ$4),\"\")","v":""},{"$f":"IFERROR(GETPIVOTDATA(\"Sum of Relative\",Pivots!$B$3,\"Player2\",$AM37,\"Team\",AR$4)/GETPIVOTDATA(\"Count of Match\",Pivots!$B$3,\"Player2\",$AM37,\"Team\",AR$4),\"\")","v":""},"",null,"",null,{"$f":"IF(AY37=\"\",\"\",GETPIVOTDATA(\"Count of Match\",Pivots!$B$3,\"Player2\",$AV37,\"Team\",1)&\"D\")&IF(AZ37=\"\",\"\",GETPIVOTDATA(\"Count of Match\",Pivots!$B$3,\"Player2\",$AV37,\"Team\",2)&\"P\")&IF(BA37=\"\",\"\",GETPIVOTDATA(\"Count of Match\",Pivots!$B$3,\"Player2\",$AV37,\"Team\",3)&\"M\")","v":""},{"$f":"IF(AV37=\"\",\"\",GETPIVOTDATA(\"Sum of Relative\",Pivots!$B$3,\"Player2\",$AV37)/GETPIVOTDATA(\"Count of Match\",Pivots!$B$3,\"Player2\",$AV37))","v":""},{"$f":"IFERROR(GETPIVOTDATA(\"Sum of Relative\",Pivots!$B$3,\"Player2\",$AV37,\"Team\",AY$4)/GETPIVOTDATA(\"Count of Match\",Pivots!$B$3,\"Player2\",$AV37,\"Team\",AY$4),\"\")","v":""},{"$f":"IFERROR(GETPIVOTDATA(\"Sum of Relative\",Pivots!$B$3,\"Player2\",$AV37,\"Team\",AZ$4)/GETPIVOTDATA(\"Count of Match\",Pivots!$B$3,\"Player2\",$AV37,\"Team\",AZ$4),\"\")","v":""},{"$f":"IFERROR(GETPIVOTDATA(\"Sum of Relative\",Pivots!$B$3,\"Player2\",$AV37,\"Team\",BA$4)/GETPIVOTDATA(\"Count of Match\",Pivots!$B$3,\"Player2\",$AV37,\"Team\",BA$4),\"\")","v":""},""]
[null,null,null,null,null,null,null,null,null,null,{"$f":"IFERROR(VLOOKUP(J38,Tables!$F$2:$H$40,2),\"\")","v":""},null,null,null,null,null,null,null,"JSk",3,{"$f":"IFERROR(GETPIVOTDATA(\"Count of Match\",Pivots!B$3,\"Player2\",S38),\"\")","v":""},null,null,null,"RJ",3,11,null,"",null,{"$f":"IF(AG38=\"\",\"\",GETPIVOTDATA(\"Count of Match\",Pivots!$B$3,\"Player2\",$AD38,\"Team\",1)&\"D\")&IF(AH38=\"\",\"\",GETPIVOTDATA(\"Count of Match\",Pivots!$B$3,\"Player2\",$AD38,\"Team\",2)&\"P\")&IF(AI38=\"\",\"\",GETPIVOTDATA(\"Count of Match\",Pivots!$B$3,\"Player2\",$AD38,\"Team\",3)&\"M\")","v":""},{"$f":"IF(AD38=\"\",\"\",GETPIVOTDATA(\"Sum of Relative\",Pivots!$B$3,\"Player2\",$AD38)/GETPIVOTDATA(\"Count of Match\",Pivots!$B$3,\"Player2\",$AD38))","v":""},{"$f":"IFERROR(GETPIVOTDATA(\"Sum of Relative\",Pivots!$B$3,\"Player2\",$AD38,\"Team\",AG$4)/GETPIVOTDATA(\"Count of Match\",Pivots!$B$3,\"Player2\",$AD38,\"Team\",AG$4),\"\")","v":""},{"$f":"IFERROR(GETPIVOTDATA(\"Sum of Relative\",Pivots!$B$3,\"Player2\",$AD38,\"Team\",AH$4)/GETPIVOTDATA(\"Count of Match\",Pivots!$B$3,\"Player2\",$AD38,\"Team\",AH$4),\"\")","v":""},{"$f":"IFERROR(GETPIVOTDATA(\"Sum of Relative\",Pivots!$B$3,\"Player2\",$AD38,\"Team\",AI$4)/GETPIVOTDATA(\"Count of Match\",Pivots!$B$3,\"Player2\",$AD38,\"Team\",AI$4),\"\")","v":""},"",null,"",null,{"$f":"IF(AP38=\"\",\"\",GETPIVOTDATA(\"Count of Match\",Pivots!$B$3,\"Player2\",$AM38,\"Team\",1)&\"D\")&IF(AQ38=\"\",\"\",GETPIVOTDATA(\"Count of Match\",Pivots!$B$3,\"Player2\",$AM38,\"Team\",2)&\"P\")&IF(AR38=\"\",\"\",GETPIVOTDATA(\"Count of Match\",Pivots!$B$3,\"Player2\",$AM38,\"Team\",3)&\"M\")","v":""},{"$f":"IF(AM38=\"\",\"\",GETPIVOTDATA(\"Sum of Relative\",Pivots!$B$3,\"Player2\",$AM38)/GETPIVOTDATA(\"Count of Match\",Pivots!$B$3,\"Player2\",$AM38))","v":""},{"$f":"IFERROR(GETPIVOTDATA(\"Sum of Relative\",Pivots!$B$3,\"Player2\",$AM38,\"Team\",AP$4)/GETPIVOTDATA(\"Count of Match\",Pivots!$B$3,\"Player2\",$AM38,\"Team\",AP$4),\"\")","v":""},{"$f":"IFERROR(GETPIVOTDATA(\"Sum of Relative\",Pivots!$B$3,\"Player2\",$AM38,\"Team\",AQ$4)/GETPIVOTDATA(\"Count of Match\",Pivots!$B$3,\"Player2\",$AM38,\"Team\",AQ$4),\"\")","v":""},{"$f":"IFERROR(GETPIVOTDATA(\"Sum of Relative\",Pivots!$B$3,\"Player2\",$AM38,\"Team\",AR$4)/GETPIVOTDATA(\"Count of Match\",Pivots!$B$3,\"Player2\",$AM38,\"Team\",AR$4),\"\")","v":""},"",null,"",null,{"$f":"IF(AY38=\"\",\"\",GETPIVOTDATA(\"Count of Match\",Pivots!$B$3,\"Player2\",$AV38,\"Team\",1)&\"D\")&IF(AZ38=\"\",\"\",GETPIVOTDATA(\"Count of Match\",Pivots!$B$3,\"Player2\",$AV38,\"Team\",2)&\"P\")&IF(BA38=\"\",\"\",GETPIVOTDATA(\"Count of Match\",Pivots!$B$3,\"Player2\",$AV38,\"Team\",3)&\"M\")","v":""},{"$f":"IF(AV38=\"\",\"\",GETPIVOTDATA(\"Sum of Relative\",Pivots!$B$3,\"Player2\",$AV38)/GETPIVOTDATA(\"Count of Match\",Pivots!$B$3,\"Player2\",$AV38))","v":""},{"$f":"IFERROR(GETPIVOTDATA(\"Sum of Relative\",Pivots!$B$3,\"Player2\",$AV38,\"Team\",AY$4)/GETPIVOTDATA(\"Count of Match\",Pivots!$B$3,\"Player2\",$AV38,\"Team\",AY$4),\"\")","v":""},{"$f":"IFERROR(GETPIVOTDATA(\"Sum of Relative\",Pivots!$B$3,\"Player2\",$AV38,\"Team\",AZ$4)/GETPIVOTDATA(\"Count of Match\",Pivots!$B$3,\"Player2\",$AV38,\"Team\",AZ$4),\"\")","v":""},{"$f":"IFERROR(GETPIVOTDATA(\"Sum of Relative\",Pivots!$B$3,\"Player2\",$AV38,\"Team\",BA$4)/GETPIVOTDATA(\"Count of Match\",Pivots!$B$3,\"Player2\",$AV38,\"Team\",BA$4),\"\")","v":""},""]
[null,null,null,null,null,null,null,null,null,null,{"$f":"IFERROR(VLOOKUP(J39,Tables!$F$2:$H$40,2),\"\")","v":""},null,null,null,null,null,null,null,"JST",3,{"$f":"IFERROR(GETPIVOTDATA(\"Count of Match\",Pivots!B$3,\"Player2\",S39),\"\")","v":""},null,null,null,"RPL",1,11,null,"",null,{"$f":"IF(AG39=\"\",\"\",GETPIVOTDATA(\"Count of Match\",Pivots!$B$3,\"Player2\",$AD39,\"Team\",1)&\"D\")&IF(AH39=\"\",\"\",GETPIVOTDATA(\"Count of Match\",Pivots!$B$3,\"Player2\",$AD39,\"Team\",2)&\"P\")&IF(AI39=\"\",\"\",GETPIVOTDATA(\"Count of Match\",Pivots!$B$3,\"Player2\",$AD39,\"Team\",3)&\"M\")","v":""},{"$f":"IF(AD39=\"\",\"\",GETPIVOTDATA(\"Sum of Relative\",Pivots!$B$3,\"Player2\",$AD39)/GETPIVOTDATA(\"Count of Match\",Pivots!$B$3,\"Player2\",$AD39))","v":""},{"$f":"IFERROR(GETPIVOTDATA(\"Sum of Relative\",Pivots!$B$3,\"Player2\",$AD39,\"Team\",AG$4)/GETPIVOTDATA(\"Count of Match\",Pivots!$B$3,\"Player2\",$AD39,\"Team\",AG$4),\"\")","v":""},{"$f":"IFERROR(GETPIVOTDATA(\"Sum of Relative\",Pivots!$B$3,\"Player2\",$AD39,\"Team\",AH$4)/GETPIVOTDATA(\"Count of Match\",Pivots!$B$3,\"Player2\",$AD39,\"Team\",AH$4),\"\")","v":""},{"$f":"IFERROR(GETPIVOTDATA(\"Sum of Relative\",Pivots!$B$3,\"Player2\",$AD39,\"Team\",AI$4)/GETPIVOTDATA(\"Count of Match\",Pivots!$B$3,\"Player2\",$AD39,\"Team\",AI$4),\"\")","v":""},"",null,"",null,{"$f":"IF(AP39=\"\",\"\",GETPIVOTDATA(\"Count of Match\",Pivots!$B$3,\"Player2\",$AM39,\"Team\",1)&\"D\")&IF(AQ39=\"\",\"\",GETPIVOTDATA(\"Count of Match\",Pivots!$B$3,\"Player2\",$AM39,\"Team\",2)&\"P\")&IF(AR39=\"\",\"\",GETPIVOTDATA(\"Count of Match\",Pivots!$B$3,\"Player2\",$AM39,\"Team\",3)&\"M\")","v":""},{"$f":"IF(AM39=\"\",\"\",GETPIVOTDATA(\"Sum of Relative\",Pivots!$B$3,\"Player2\",$AM39)/GETPIVOTDATA(\"Count of Match\",Pivots!$B$3,\"Player2\",$AM39))","v":""},{"$f":"IFERROR(GETPIVOTDATA(\"Sum of Relative\",Pivots!$B$3,\"Player2\",$AM39,\"Team\",AP$4)/GETPIVOTDATA(\"Count of Match\",Pivots!$B$3,\"Player2\",$AM39,\"Team\",AP$4),\"\")","v":""},{"$f":"IFERROR(GETPIVOTDATA(\"Sum of Relative\",Pivots!$B$3,\"Player2\",$AM39,\"Team\",AQ$4)/GETPIVOTDATA(\"Count of Match\",Pivots!$B$3,\"Player2\",$AM39,\"Team\",AQ$4),\"\")","v":""},{"$f":"IFERROR(GETPIVOTDATA(\"Sum of Relative\",Pivots!$B$3,\"Player2\",$AM39,\"Team\",AR$4)/GETPIVOTDATA(\"Count of Match\",Pivots!$B$3,\"Player2\",$AM39,\"Team\",AR$4),\"\")","v":""},"",null,"",null,{"$f":"IF(AY39=\"\",\"\",GETPIVOTDATA(\"Count of Match\",Pivots!$B$3,\"Player2\",$AV39,\"Team\",1)&\"D\")&IF(AZ39=\"\",\"\",GETPIVOTDATA(\"Count of Match\",Pivots!$B$3,\"Player2\",$AV39,\"Team\",2)&\"P\")&IF(BA39=\"\",\"\",GETPIVOTDATA(\"Count of Match\",Pivots!$B$3,\"Player2\",$AV39,\"Team\",3)&\"M\")","v":""},{"$f":"IF(AV39=\"\",\"\",GETPIVOTDATA(\"Sum of Relative\",Pivots!$B$3,\"Player2\",$AV39)/GETPIVOTDATA(\"Count of Match\",Pivots!$B$3,\"Player2\",$AV39))","v":""},{"$f":"IFERROR(GETPIVOTDATA(\"Sum of Relative\",Pivots!$B$3,\"Player2\",$AV39,\"Team\",AY$4)/GETPIVOTDATA(\"Count of Match\",Pivots!$B$3,\"Player2\",$AV39,\"Team\",AY$4),\"\")","v":""},{"$f":"IFERROR(GETPIVOTDATA(\"Sum of Relative\",Pivots!$B$3,\"Player2\",$AV39,\"Team\",AZ$4)/GETPIVOTDATA(\"Count of Match\",Pivots!$B$3,\"Player2\",$AV39,\"Team\",AZ$4),\"\")","v":""},{"$f":"IFERROR(GETPIVOTDATA(\"Sum of Relative\",Pivots!$B$3,\"Player2\",$AV39,\"Team\",BA$4)/GETPIVOTDATA(\"Count of Match\",Pivots!$B$3,\"Player2\",$AV39,\"Team\",BA$4),\"\")","v":""},""]
[null,null,null,null,null,null,null,null,null,null,{"$f":"IFERROR(VLOOKUP(J40,Tables!$F$2:$H$40,2),\"\")","v":""},null,null,null,null,null,null,null,"JuS",3,{"$f":"IFERROR(GETPIVOTDATA(\"Count of Match\",Pivots!B$3,\"Player2\",S40),\"\")","v":4},null,null,null,"RS",3,9,null,"",null,{"$f":"IF(AG40=\"\",\"\",GETPIVOTDATA(\"Count of Match\",Pivots!$B$3,\"Player2\",$AD40,\"Team\",1)&\"D\")&IF(AH40=\"\",\"\",GETPIVOTDATA(\"Count of Match\",Pivots!$B$3,\"Player2\",$AD40,\"Team\",2)&\"P\")&IF(AI40=\"\",\"\",GETPIVOTDATA(\"Count of Match\",Pivots!$B$3,\"Player2\",$AD40,\"Team\",3)&\"M\")","v":""},{"$f":"IF(AD40=\"\",\"\",GETPIVOTDATA(\"Sum of Relative\",Pivots!$B$3,\"Player2\",$AD40)/GETPIVOTDATA(\"Count of Match\",Pivots!$B$3,\"Player2\",$AD40))","v":""},{"$f":"IFERROR(GETPIVOTDATA(\"Sum of Relative\",Pivots!$B$3,\"Player2\",$AD40,\"Team\",AG$4)/GETPIVOTDATA(\"Count of Match\",Pivots!$B$3,\"Player2\",$AD40,\"Team\",AG$4),\"\")","v":""},{"$f":"IFERROR(GETPIVOTDATA(\"Sum of Relative\",Pivots!$B$3,\"Player2\",$AD40,\"Team\",AH$4)/GETPIVOTDATA(\"Count of Match\",Pivots!$B$3,\"Player2\",$AD40,\"Team\",AH$4),\"\")","v":""},{"$f":"IFERROR(GETPIVOTDATA(\"Sum of Relative\",Pivots!$B$3,\"Player2\",$AD40,\"Team\",AI$4)/GETPIVOTDATA(\"Count of Match\",Pivots!$B$3,\"Player2\",$AD40,\"Team\",AI$4),\"\")","v":""},"",null,"",null,{"$f":"IF(AP40=\"\",\"\",GETPIVOTDATA(\"Count of Match\",Pivots!$B$3,\"Player2\",$AM40,\"Team\",1)&\"D\")&IF(AQ40=\"\",\"\",GETPIVOTDATA(\"Count of Match\",Pivots!$B$3,\"Player2\",$AM40,\"Team\",2)&\"P\")&IF(AR40=\"\",\"\",GETPIVOTDATA(\"Count of Match\",Pivots!$B$3,\"Player2\",$AM40,\"Team\",3)&\"M\")","v":""},{"$f":"IF(AM40=\"\",\"\",GETPIVOTDATA(\"Sum of Relative\",Pivots!$B$3,\"Player2\",$AM40)/GETPIVOTDATA(\"Count of Match\",Pivots!$B$3,\"Player2\",$AM40))","v":""},{"$f":"IFERROR(GETPIVOTDATA(\"Sum of Relative\",Pivots!$B$3,\"Player2\",$AM40,\"Team\",AP$4)/GETPIVOTDATA(\"Count of Match\",Pivots!$B$3,\"Player2\",$AM40,\"Team\",AP$4),\"\")","v":""},{"$f":"IFERROR(GETPIVOTDATA(\"Sum of Relative\",Pivots!$B$3,\"Player2\",$AM40,\"Team\",AQ$4)/GETPIVOTDATA(\"Count of Match\",Pivots!$B$3,\"Player2\",$AM40,\"Team\",AQ$4),\"\")","v":""},{"$f":"IFERROR(GETPIVOTDATA(\"Sum of Relative\",Pivots!$B$3,\"Player2\",$AM40,\"Team\",AR$4)/GETPIVOTDATA(\"Count of Match\",Pivots!$B$3,\"Player2\",$AM40,\"Team\",AR$4),\"\")","v":""},"",null,"",null,{"$f":"IF(AY40=\"\",\"\",GETPIVOTDATA(\"Count of Match\",Pivots!$B$3,\"Player2\",$AV40,\"Team\",1)&\"D\")&IF(AZ40=\"\",\"\",GETPIVOTDATA(\"Count of Match\",Pivots!$B$3,\"Player2\",$AV40,\"Team\",2)&\"P\")&IF(BA40=\"\",\"\",GETPIVOTDATA(\"Count of Match\",Pivots!$B$3,\"Player2\",$AV40,\"Team\",3)&\"M\")","v":""},{"$f":"IF(AV40=\"\",\"\",GETPIVOTDATA(\"Sum of Relative\",Pivots!$B$3,\"Player2\",$AV40)/GETPIVOTDATA(\"Count of Match\",Pivots!$B$3,\"Player2\",$AV40))","v":""},{"$f":"IFERROR(GETPIVOTDATA(\"Sum of Relative\",Pivots!$B$3,\"Player2\",$AV40,\"Team\",AY$4)/GETPIVOTDATA(\"Count of Match\",Pivots!$B$3,\"Player2\",$AV40,\"Team\",AY$4),\"\")","v":""},{"$f":"IFERROR(GETPIVOTDATA(\"Sum of Relative\",Pivots!$B$3,\"Player2\",$AV40,\"Team\",AZ$4)/GETPIVOTDATA(\"Count of Match\",Pivots!$B$3,\"Player2\",$AV40,\"Team\",AZ$4),\"\")","v":""},{"$f":"IFERROR(GETPIVOTDATA(\"Sum of Relative\",Pivots!$B$3,\"Player2\",$AV40,\"Team\",BA$4)/GETPIVOTDATA(\"Count of Match\",Pivots!$B$3,\"Player2\",$AV40,\"Team\",BA$4),\"\")","v":""},""]
[null,null,null,null,null,null,null,null,null,null,{"$f":"IFERROR(VLOOKUP(J41,Tables!$F$2:$H$40,2),\"\")","v":""},null,null,null,null,null,null,null,"KAR",3,{"$f":"IFERROR(GETPIVOTDATA(\"Count of Match\",Pivots!B$3,\"Player2\",S41),\"\")","v":""},null,null,null,"RW",3,3,null,"",null,{"$f":"IF(AG41=\"\",\"\",GETPIVOTDATA(\"Count of Match\",Pivots!$B$3,\"Player2\",$AD41,\"Team\",1)&\"D\")&IF(AH41=\"\",\"\",GETPIVOTDATA(\"Count of Match\",Pivots!$B$3,\"Player2\",$AD41,\"Team\",2)&\"P\")&IF(AI41=\"\",\"\",GETPIVOTDATA(\"Count of Match\",Pivots!$B$3,\"Player2\",$AD41,\"Team\",3)&\"M\")","v":""},{"$f":"IF(AD41=\"\",\"\",GETPIVOTDATA(\"Sum of Relative\",Pivots!$B$3,\"Player2\",$AD41)/GETPIVOTDATA(\"Count of Match\",Pivots!$B$3,\"Player2\",$AD41))","v":""},{"$f":"IFERROR(GETPIVOTDATA(\"Sum of Relative\",Pivots!$B$3,\"Player2\",$AD41,\"Team\",AG$4)/GETPIVOTDATA(\"Count of Match\",Pivots!$B$3,\"Player2\",$AD41,\"Team\",AG$4),\"\")","v":""},{"$f":"IFERROR(GETPIVOTDATA(\"Sum of Relative\",Pivots!$B$3,\"Player2\",$AD41,\"Team\",AH$4)/GETPIVOTDATA(\"Count of Match\",Pivots!$B$3,\"Player2\",$AD41,\"Team\",AH$4),\"\")","v":""},{"$f":"IFERROR(GETPIVOTDATA(\"Sum of Relative\",Pivots!$B$3,\"Player2\",$AD41,\"Team\",AI$4)/GETPIVOTDATA(\"Count of Match\",Pivots!$B$3,\"Player2\",$AD41,\"Team\",AI$4),\"\")","v":""},"",null,"",null,{"$f":"IF(AP41=\"\",\"\",GETPIVOTDATA(\"Count of Match\",Pivots!$B$3,\"Player2\",$AM41,\"Team\",1)&\"D\")&IF(AQ41=\"\",\"\",GETPIVOTDATA(\"Count of Match\",Pivots!$B$3,\"Player2\",$AM41,\"Team\",2)&\"P\")&IF(AR41=\"\",\"\",GETPIVOTDATA(\"Count of Match\",Pivots!$B$3,\"Player2\",$AM41,\"Team\",3)&\"M\")","v":""},{"$f":"IF(AM41=\"\",\"\",GETPIVOTDATA(\"Sum of Relative\",Pivots!$B$3,\"Player2\",$AM41)/GETPIVOTDATA(\"Count of Match\",Pivots!$B$3,\"Player2\",$AM41))","v":""},{"$f":"IFERROR(GETPIVOTDATA(\"Sum of Relative\",Pivots!$B$3,\"Player2\",$AM41,\"Team\",AP$4)/GETPIVOTDATA(\"Count of Match\",Pivots!$B$3,\"Player2\",$AM41,\"Team\",AP$4),\"\")","v":""},{"$f":"IFERROR(GETPIVOTDATA(\"Sum of Relative\",Pivots!$B$3,\"Player2\",$AM41,\"Team\",AQ$4)/GETPIVOTDATA(\"Count of Match\",Pivots!$B$3,\"Player2\",$AM41,\"Team\",AQ$4),\"\")","v":""},{"$f":"IFERROR(GETPIVOTDATA(\"Sum of Relative\",Pivots!$B$3,\"Player2\",$AM41,\"Team\",AR$4)/GETPIVOTDATA(\"Count of Match\",Pivots!$B$3,\"Player2\",$AM41,\"Team\",AR$4),\"\")","v":""},"",null,"",null,{"$f":"IF(AY41=\"\",\"\",GETPIVOTDATA(\"Count of Match\",Pivots!$B$3,\"Player2\",$AV41,\"Team\",1)&\"D\")&IF(AZ41=\"\",\"\",GETPIVOTDATA(\"Count of Match\",Pivots!$B$3,\"Player2\",$AV41,\"Team\",2)&\"P\")&IF(BA41=\"\",\"\",GETPIVOTDATA(\"Count of Match\",Pivots!$B$3,\"Player2\",$AV41,\"Team\",3)&\"M\")","v":""},{"$f":"IF(AV41=\"\",\"\",GETPIVOTDATA(\"Sum of Relative\",Pivots!$B$3,\"Player2\",$AV41)/GETPIVOTDATA(\"Count of Match\",Pivots!$B$3,\"Player2\",$AV41))","v":""},{"$f":"IFERROR(GETPIVOTDATA(\"Sum of Relative\",Pivots!$B$3,\"Player2\",$AV41,\"Team\",AY$4)/GETPIVOTDATA(\"Count of Match\",Pivots!$B$3,\"Player2\",$AV41,\"Team\",AY$4),\"\")","v":""},{"$f":"IFERROR(GETPIVOTDATA(\"Sum of Relative\",Pivots!$B$3,\"Player2\",$AV41,\"Team\",AZ$4)/GETPIVOTDATA(\"Count of Match\",Pivots!$B$3,\"Player2\",$AV41,\"Team\",AZ$4),\"\")","v":""},{"$f":"IFERROR(GETPIVOTDATA(\"Sum of Relative\",Pivots!$B$3,\"Player2\",$AV41,\"Team\",BA$4)/GETPIVOTDATA(\"Count of Match\",Pivots!$B$3,\"Player2\",$AV41,\"Team\",BA$4),\"\")","v":""},""]
[null,null,null,null,null,null,null,null,null,null,{"$f":"IFERROR(VLOOKUP(J42,Tables!$F$2:$H$40,2),\"\")","v":""},null,null,null,null,null,null,null,"KAS",3,{"$f":"IFERROR(GETPIVOTDATA(\"Count of Match\",Pivots!B$3,\"Player2\",S42),\"\")","v":2},null,null,null,"TG",3,4,null,"",null,{"$f":"IF(AG42=\"\",\"\",GETPIVOTDATA(\"Count of Match\",Pivots!$B$3,\"Player2\",$AD42,\"Team\",1)&\"D\")&IF(AH42=\"\",\"\",GETPIVOTDATA(\"Count of Match\",Pivots!$B$3,\"Player2\",$AD42,\"Team\",2)&\"P\")&IF(AI42=\"\",\"\",GETPIVOTDATA(\"Count of Match\",Pivots!$B$3,\"Player2\",$AD42,\"Team\",3)&\"M\")","v":""},{"$f":"IF(AD42=\"\",\"\",GETPIVOTDATA(\"Sum of Relative\",Pivots!$B$3,\"Player2\",$AD42)/GETPIVOTDATA(\"Count of Match\",Pivots!$B$3,\"Player2\",$AD42))","v":""},{"$f":"IFERROR(GETPIVOTDATA(\"Sum of Relative\",Pivots!$B$3,\"Player2\",$AD42,\"Team\",AG$4)/GETPIVOTDATA(\"Count of Match\",Pivots!$B$3,\"Player2\",$AD42,\"Team\",AG$4),\"\")","v":""},{"$f":"IFERROR(GETPIVOTDATA(\"Sum of Relative\",Pivots!$B$3,\"Player2\",$AD42,\"Team\",AH$4)/GETPIVOTDATA(\"Count of Match\",Pivots!$B$3,\"Player2\",$AD42,\"Team\",AH$4),\"\")","v":""},{"$f":"IFERROR(GETPIVOTDATA(\"Sum of Relative\",Pivots!$B$3,\"Player2\",$AD42,\"Team\",AI$4)/GETPIVOTDATA(\"Count of Match\",Pivots!$B$3,\"Player2\",$AD42,\"Team\",AI$4),\"\")","v":""},"",null,null,null,{"$f":"IF(AP42=\"\",\"\",GETPIVOTDATA(\"Count of Match\",Pivots!$B$3,\"Player2\",$AM42,\"Team\",1)&\"D\")&IF(AQ42=\"\",\"\",GETPIVOTDATA(\"Count of Match\",Pivots!$B$3,\"Player2\",$AM42,\"Team\",2)&\"P\")&IF(AR42=\"\",\"\",GETPIVOTDATA(\"Count of Match\",Pivots!$B$3,\"Player2\",$AM42,\"Team\",3)&\"M\")","v":""},{"$f":"IF(AM42=\"\",\"\",GETPIVOTDATA(\"Sum of Relative\",Pivots!$B$3,\"Player2\",$AM42)/GETPIVOTDATA(\"Count of Match\",Pivots!$B$3,\"Player2\",$AM42))","v":""},{"$f":"IFERROR(GETPIVOTDATA(\"Sum of Relative\",Pivots!$B$3,\"Player2\",$AM42,\"Team\",AP$4)/GETPIVOTDATA(\"Count of Match\",Pivots!$B$3,\"Player2\",$AM42,\"Team\",AP$4),\"\")","v":""},{"$f":"IFERROR(GETPIVOTDATA(\"Sum of Relative\",Pivots!$B$3,\"Player2\",$AM42,\"Team\",AQ$4)/GETPIVOTDATA(\"Count of Match\",Pivots!$B$3,\"Player2\",$AM42,\"Team\",AQ$4),\"\")","v":""},{"$f":"IFERROR(GETPIVOTDATA(\"Sum of Relative\",Pivots!$B$3,\"Player2\",$AM42,\"Team\",AR$4)/GETPIVOTDATA(\"Count of Match\",Pivots!$B$3,\"Player2\",$AM42,\"Team\",AR$4),\"\")","v":""},"",null,"",null,{"$f":"IF(AY42=\"\",\"\",GETPIVOTDATA(\"Count of Match\",Pivots!$B$3,\"Player2\",$AV42,\"Team\",1)&\"D\")&IF(AZ42=\"\",\"\",GETPIVOTDATA(\"Count of Match\",Pivots!$B$3,\"Player2\",$AV42,\"Team\",2)&\"P\")&IF(BA42=\"\",\"\",GETPIVOTDATA(\"Count of Match\",Pivots!$B$3,\"Player2\",$AV42,\"Team\",3)&\"M\")","v":""},{"$f":"IF(AV42=\"\",\"\",GETPIVOTDATA(\"Sum of Relative\",Pivots!$B$3,\"Player2\",$AV42)/GETPIVOTDATA(\"Count of Match\",Pivots!$B$3,\"Player2\",$AV42))","v":""},{"$f":"IFERROR(GETPIVOTDATA(\"Sum of Relative\",Pivots!$B$3,\"Player2\",$AV42,\"Team\",AY$4)/GETPIVOTDATA(\"Count of Match\",Pivots!$B$3,\"Player2\",$AV42,\"Team\",AY$4),\"\")","v":""},{"$f":"IFERROR(GETPIVOTDATA(\"Sum of Relative\",Pivots!$B$3,\"Player2\",$AV42,\"Team\",AZ$4)/GETPIVOTDATA(\"Count of Match\",Pivots!$B$3,\"Player2\",$AV42,\"Team\",AZ$4),\"\")","v":""},{"$f":"IFERROR(GETPIVOTDATA(\"Sum of Relative\",Pivots!$B$3,\"Player2\",$AV42,\"Team\",BA$4)/GETPIVOTDATA(\"Count of Match\",Pivots!$B$3,\"Player2\",$AV42,\"Team\",BA$4),\"\")","v":""},""]
[null,null,null,null,null,null,null,null,null,null,null,null,null,null,null,null,null,null,"KM",3,{"$f":"IFERROR(GETPIVOTDATA(\"Count of Match\",Pivots!B$3,\"Player2\",S43),\"\")","v":""},null,null,null,"TH",1,3]
[null,null,null,null,null,null,null,null,null,null,null,null,null,null,null,null,null,null,"KSH",3,{"$f":"IFERROR(GETPIVOTDATA(\"Count of Match\",Pivots!B$3,\"Player2\",S44),\"\")","v":""},null,null,null,"TL",3,9]
[null,null,null,null,null,null,null,null,null,null,null,null,null,null,null,null,null,null,"KST",1,{"$f":"IFERROR(GETPIVOTDATA(\"Count of Match\",Pivots!B$3,\"Player2\",S45),\"\")","v":8},null,null,null,"VC",2,6]
[null,null,null,null,null,null,null,null,null,null,null,null,null,null,null,null,null,null,"LG",1,{"$f":"IFERROR(GETPIVOTDATA(\"Count of Match\",Pivots!B$3,\"Player2\",S46),\"\")","v":""},null,null,null,"WA",2,5]
[null,null,null,null,null,null,null,null,null,null,null,null,null,null,null,null,null,null,"LH",3,{"$f":"IFERROR(GETPIVOTDATA(\"Count of Match\",Pivots!B$3,\"Player2\",S47),\"\")","v":3},null,null,null,"(blank)"]
[null,null,null,null,null,null,null,null,null,null,null,null,null,null,null,null,null,null,"MB",2,{"$f":"IFERROR(GETPIVOTDATA(\"Count of Match\",Pivots!B$3,\"Player2\",S48),\"\")","v":6},null,null,null,"Grand Total",87,287]
[null,null,null,null,null,null,null,null,null,null,null,null,null,null,null,null,null,null,"MG",3,{"$f":"IFERROR(GETPIVOTDATA(\"Count of Match\",Pivots!B$3,\"Player2\",S49),\"\")","v":""}]
[null,null,null,null,null,null,null,null,null,null,null,null,null,null,null,null,null,null,"MJ",3,{"$f":"IFERROR(GETPIVOTDATA(\"Count of Match\",Pivots!B$3,\"Player2\",S50),\"\")","v":""}]
[null,null,null,null,null,null,null,null,null,null,null,null,null,null,null,null,null,null,"ML",3,{"$f":"IFERROR(GETPIVOTDATA(\"Count of Match\",Pivots!B$3,\"Player2\",S51),\"\")","v":1}]
[null,null,null,null,null,null,null,null,null,null,null,null,null,null,null,null,null,null,"MM",3,{"$f":"IFERROR(GETPIVOTDATA(\"Count of Match\",Pivots!B$3,\"Player2\",S52),\"\")","v":""}]
[null,null,null,null,null,null,null,null,null,null,null,null,null,null,null,null,null,null,"MR",2,{"$f":"IFERROR(GETPIVOTDATA(\"Count of Match\",Pivots!B$3,\"Player2\",S53),\"\")","v":10}]
[null,null,null,null,null,null,null,null,null,null,null,null,null,null,null,null,null,null,"MW",2,{"$f":"IFERROR(GETPIVOTDATA(\"Count of Match\",Pivots!B$3,\"Player2\",S54),\"\")","v":9}]
[null,null,null,null,null,null,null,null,null,null,null,null,null,null,null,null,null,null,"NA",3,{"$f":"IFERROR(GETPIVOTDATA(\"Count of Match\",Pivots!B$3,\"Player2\",S55),\"\")","v":""}]
[null,null,null,null,null,null,null,null,null,null,null,null,null,null,null,null,null,null,"NF",3,{"$f":"IFERROR(GETPIVOTDATA(\"Count of Match\",Pivots!B$3,\"Player2\",S56),\"\")","v":""}]
[null,null,null,null,null,null,null,null,null,null,null,null,null,null,null,null,null,null,"PC",3,{"$f":"IFERROR(GETPIVOTDATA(\"Count of Match\",Pivots!B$3,\"Player2\",S57),\"\")","v":""}]
[null,null,null,null,null,null,null,null,null,null,null,null,null,null,null,null,null,null,"PD",1,{"$f":"IFERROR(GETPIVOTDATA(\"Count of Match\",Pivots!B$3,\"Player2\",S58),\"\")","v":12}]
[null,null,null,null,null,null,null,null,null,null,null,null,null,null,null,null,null,null,"PL",2,{"$f":"IFERROR(GETPIVOTDATA(\"Count of Match\",Pivots!B$3,\"Player2\",S59),\"\")","v":9}]
[null,null,null,null,null,null,null,null,null,null,null,null,null,null,null,null,null,null,"PM",3,{"$f":"IFERROR(GETPIVOTDATA(\"Count of Match\",Pivots!B$3,\"Player2\",S60),\"\")","v":""}]
[null,null,null,null,null,null,null,null,null,null,null,null,null,null,null,null,null,null,"PPE",2,{"$f":"IFERROR(GETPIVOTDATA(\"Count of Match\",Pivots!B$3,\"Player2\",S61),\"\")","v":6}]
[null,null,null,null,null,null,null,null,null,null,null,null,null,null,null,null,null,null,"PPH",2,{"$f":"IFERROR(GETPIVOTDATA(\"Count of Match\",Pivots!B$3,\"Player2\",S62),\"\")","v":9}]
[null,null,null,null,null,null,null,null,null,null,null,null,null,null,null,null,null,null,"PSH",1,{"$f":"IFERROR(GETPIVOTDATA(\"Count of Match\",Pivots!B$3,\"Player2\",S63),\"\")","v":10}]
[null,null,null,null,null,null,null,null,null,null,null,null,null,null,null,null,null,null,"PSW",2,{"$f":"IFERROR(GETPIVOTDATA(\"Count of Match\",Pivots!B$3,\"Player2\",S64),\"\")","v":9}]
[null,null,null,null,null,null,null,null,null,null,null,null,null,null,null,null,null,null,"PW",3,{"$f":"IFERROR(GETPIVOTDATA(\"Count of Match\",Pivots!B$3,\"Player2\",S65),\"\")","v":12}]
[null,null,null,null,null,null,null,null,null,null,null,null,null,null,null,null,null,null,"RB",1,{"$f":"IFERROR(GETPIVOTDATA(\"Count of Match\",Pivots!B$3,\"Player2\",S66),\"\")","v":11}]
[null,null,null,null,null,null,null,null,null,null,null,null,null,null,null,null,null,null,"RCM",1,{"$f":"IFERROR(GETPIVOTDATA(\"Count of Match\",Pivots!B$3,\"Player2\",S67),\"\")","v":10}]
[null,null,null,null,null,null,null,null,null,null,null,null,null,null,null,null,null,null,"RCO",2,{"$f":"IFERROR(GETPIVOTDATA(\"Count of Match\",Pivots!B$3,\"Player2\",S68),\"\")","v":7}]
[null,null,null,null,null,null,null,null,null,null,null,null,null,null,null,null,null,null,"RHA",3,{"$f":"IFERROR(GETPIVOTDATA(\"Count of Match\",Pivots!B$3,\"Player2\",S69),\"\")","v":9}]
[null,null,null,null,null,null,null,null,null,null,null,null,null,null,null,null,null,null,"RHE",3,{"$f":"IFERROR(GETPIVOTDATA(\"Count of Match\",Pivots!B$3,\"Player2\",S70),\"\")","v":""}]
[null,null,null,null,null,null,null,null,null,null,null,null,null,null,null,null,null,null,"RJ",3,{"$f":"IFERROR(GETPIVOTDATA(\"Count of Match\",Pivots!B$3,\"Player2\",S71),\"\")","v":11}]
[null,null,null,null,null,null,null,null,null,null,null,null,null,null,null,null,null,null,"RN",3,{"$f":"IFERROR(GETPIVOTDATA(\"Count of Match\",Pivots!B$3,\"Player2\",S72),\"\")","v":""}]
[null,null,null,null,null,null,null,null,null,null,null,null,null,null,null,null,null,null,"RPL",1,{"$f":"IFERROR(GETPIVOTDATA(\"Count of Match\",Pivots!B$3,\"Player2\",S73),\"\")","v":11}]
[null,null,null,null,null,null,null,null,null,null,null,null,null,null,null,null,null,null,"RS",3,{"$f":"IFERROR(GETPIVOTDATA(\"Count of Match\",Pivots!B$3,\"Player2\",S74),\"\")","v":9}]
[null,null,null,null,null,null,null,null,null,null,null,null,null,null,null,null,null,null,"RW",3,{"$f":"IFERROR(GETPIVOTDATA(\"Count of Match\",Pivots!B$3,\"Player2\",S75),\"\")","v":3}]
[null,null,null,null,null,null,null,null,null,null,null,null,null,null,null,null,null,null,"SP",3,{"$f":"IFERROR(GETPIVOTDATA(\"Count of Match\",Pivots!B$3,\"Player2\",S76),\"\")","v":""}]
[null,null,null,null,null,null,null,null,null,null,null,null,null,null,null,null,null,null,"SS",3,{"$f":"IFERROR(GETPIVOTDATA(\"Count of Match\",Pivots!B$3,\"Player2\",S77),\"\")","v":""}]
[null,null,null,null,null,null,null,null,null,null,null,null,null,null,null,null,null,null,"TG",3,{"$f":"IFERROR(GETPIVOTDATA(\"Count of Match\",Pivots!B$3,\"Player2\",S78),\"\")","v":4}]
[null,null,null,null,null,null,null,null,null,null,null,null,null,null,null,null,null,null,"TH",1,{"$f":"IFERROR(GETPIVOTDATA(\"Count of Match\",Pivots!B$3,\"Player2\",S79),\"\")","v":3}]
[null,null,null,null,null,null,null,null,null,null,null,null,null,null,null,null,null,null,"TL",3,{"$f":"IFERROR(GETPIVOTDATA(\"Count of Match\",Pivots!B$3,\"Player2\",S80),\"\")","v":9}]
[null,null,null,null,null,null,null,null,null,null,null,null,null,null,null,null,null,null,"TR",3,{"$f":"IFERROR(GETPIVOTDATA(\"Count of Match\",Pivots!B$3,\"Player2\",S81),\"\")","v":""}]
[null,null,null,null,null,null,null,null,null,null,null,null,null,null,null,null,null,null,"VC",2,{"$f":"IFERROR(GETPIVOTDATA(\"Count of Match\",Pivots!B$3,\"Player2\",S82),\"\")","v":6}]
[null,null,null,null,null,null,null,null,null,null,null,null,null,null,null,null,null,null,"WA",2,{"$f":"IFERROR(GETPIVOTDATA(\"Count of Match\",Pivots!B$3,\"Player2\",S83),\"\")","v":5}]
[null,null,null,null,null,null,null,null,null,null,null,null,null,null,null,null,null,null,null,null,{"$f":"IFERROR(GETPIVOTDATA(\"Count of Match\",Pivots!B$3,\"Player2\",S84),\"\")","v":""}]
[null,null,null,null,null,null,null,null,null,null,null,null,null,null,null,null,null,null,null,null,{"$f":"IFERROR(GETPIVOTDATA(\"Count of Match\",Pivots!B$3,\"Player2\",S85),\"\")","v":""}]
[null,null,null,null,null,null,null,null,null,null,null,null,null,null,null,null,null,null,null,null,{"$f":"IFERROR(GETPIVOTDATA(\"Count of Match\",Pivots!B$3,\"Player2\",S86),\"\")","v":""}]
[null,null,null,null,null,null,null,null,null,null,null,null,null,null,null,null,null,null,null,null,{"$f":"IFERROR(GETPIVOTDATA(\"Count of Match\",Pivots!B$3,\"Player2\",S87),\"\")","v":""}]
[null,null,null,null,null,null,null,null,null,null,null,null,null,null,null,null,null,null,null,null,{"$f":"IFERROR(GETPIVOTDATA(\"Count of Match\",Pivots!B$3,\"Player2\",S88),\"\")","v":""}]
[null,null,null,null,null,null,null,null,null,null,null,null,null,null,null,null,null,null,null,null,{"$f":"IFERROR(GETPIVOTDATA(\"Count of Match\",Pivots!B$3,\"Player2\",S89),\"\")","v":""}]
[null,null,null,null,null,null,null,null,null,null,null,null,null,null,null,null,null,null,null,null,{"$f":"IFERROR(GETPIVOTDATA(\"Count of Match\",Pivots!B$3,\"Player2\",S90),\"\")","v":""}]
[null,null,null,null,null,null,null,null,null,null,null,null,null,null,null,null,null,null,null,null,{"$f":"IFERROR(GETPIVOTDATA(\"Count of Match\",Pivots!B$3,\"Player2\",S91),\"\")","v":""}]
[null,null,null,null,null,null,null,null,null,null,null,null,null,null,null,null,null,null,null,null,{"$f":"IFERROR(GETPIVOTDATA(\"Count of Match\",Pivots!B$3,\"Player2\",S92),\"\")","v":""}]
[null,null,null,null,null,null,null,null,null,null,null,null,null,null,null,null,null,null,null,null,{"$f":"IFERROR(GETPIVOTDATA(\"Count of Match\",Pivots!B$3,\"Player2\",S93),\"\")","v":""}]
[null,null,null,null,null,null,null,null,null,null,null,null,null,null,null,null,null,null,null,null,{"$f":"IFERROR(GETPIVOTDATA(\"Count of Match\",Pivots!B$3,\"Player2\",S94),\"\")","v":""}]
[null,null,null,null,null,null,null,null,null,null,null,null,null,null,null,null,null,null,null,null,{"$f":"IFERROR(GETPIVOTDATA(\"Count of Match\",Pivots!B$3,\"Player2\",S95),\"\")","v":""}]
[null,null,null,null,null,null,null,null,null,null,null,null,null,null,null,null,null,null,null,null,{"$f":"IFERROR(GETPIVOTDATA(\"Count of Match\",Pivots!B$3,\"Player2\",S96),\"\")","v":""}]
[null,null,null,null,null,null,null,null,null,null,null,null,null,null,null,null,null,null,null,null,{"$f":"IFERROR(GETPIVOTDATA(\"Count of Match\",Pivots!B$3,\"Player2\",S97),\"\")","v":""}]
[null,null,null,null,null,null,null,null,null,null,null,null,null,null,null,null,null,null,null,null,{"$f":"IFERROR(GETPIVOTDATA(\"Count of Match\",Pivots!B$3,\"Player2\",S98),\"\")","v":""}]
[null,null,null,null,null,null,null,null,null,null,null,null,null,null,null,null,null,null,null,null,{"$f":"IFERROR(GETPIVOTDATA(\"Count of Match\",Pivots!B$3,\"Player2\",S99),\"\")","v":""}]
[null,null,null,null,null,null,null,null,null,null,null,null,null,null,null,null,null,null,null,null,{"$f":"IFERROR(GETPIVOTDATA(\"Count of Match\",Pivots!B$3,\"Player2\",S100),\"\")","v":""}]
[null,null,null,null,null,null,null,null,null,null,null,null,null,null,null,null,null,null,null,null,{"$f":"IFERROR(GETPIVOTDATA(\"Count of Match\",Pivots!B$3,\"Player2\",S101),\"\")","v":""}]
[null,null,null,null,null,null,null,null,null,null,null,null,null,null,null,null,null,null,null,null,{"$f":"IFERROR(GETPIVOTDATA(\"Count of Match\",Pivots!B$3,\"Player2\",S102),\"\")","v":""}]
[null,null,null,null,null,null,null,null,null,null,null,null,null,null,null,null,null,null,null,null,{"$f":"IFERROR(GETPIVOTDATA(\"Count of Match\",Pivots!B$3,\"Player2\",S103),\"\")","v":""}]

{"sheet":"Players","index":4,"n_rows":80,"n_cols":3,"rows_kept":80,"cut":false,"hidden":true,"merged":[]}
["Player","Name","Guess T"]
["AA","Angelos Agathangelou",3]
["AC","Andrew Courtman",3]
["AKA","Ashok Kwatra",3]
["AKM","Andrew Kambites",1]
["APO","Andrea Powell",3]
["APR","Alison Pritchard",3]
["AS","Allan Sanis",3]
["AW","Alan Wearmouth",1]
["BG","Brian Goalby",2]
["BR","Ben Ritacca",3]
["BY","Bryony Youngs",1]
["CK","Chris Kinloch",1]
["CL","Chris Lewis",3]
["CM","Cynthia Moore",3]
["CRO","Claire Robinson",1]
["DA","David Atthey",3]
["DHA","David Hauser",3]
["DHO","Daphne Hogarth",3]
["DHP","Dave Hope",1]
["DN","Diana Nettleton",1]
["DR","Derek Rue",1]
["DS","David Simons",3]
["ED","Liz Davies",3]
["GB","George Barrett",2]
["GS","Graham Sadie",1]
["GW","Gary Watson",1]
["HF","Hussain Fatemian",3]
["IC","Ian Constable",3]
["JAN","Joe Angseesing",1]
["JAR","John Arblaster",2]
["JAT","John Atthey",1]
["JC","John Councer",2]
["JSI","Jim Simons",2]
["JSk","John Skjonnemand",3]
["JST","John Stirrup",3]
["JuS","Judy Sanis",3]
["KAR","K A Rahim",3]
["KAS","Anne Swannell",3]
["KM","Kate Morgan",3]
["KSH","Keith Sharp",3]
["KST","Keith Stanley",1]
["LG","Lindsay Geddes",1]
["LH","Lesley Harrison",3]
["MB","Mel Barlow",2]
["MG","Malcolm Green",3]
["MJ","Mary Jones ",3]
["ML","Mike Lewis",3]
["MM","Martin McWilliam",3]
["MR","Mark Rogers",2]
["MW","Mike Wignall",2]
["NA","Norah Allen",3]
["NF","Nicky Ferguson",3]
["PC","Paul Clark",3]
["PD","Paul Denning",1]
["PL","Paul Lilley",2]
["PM","Phillip Morgan",3]
["PPE","Pam Pearce",2]
["PPH","Patrick Phair",2]
["PSH","Patrick Shields",1]
["PSW","Peter Swales",2]
["PW","Peter Waggett",3]
["RB","Richard Butland",1]
["RCM","Richard Chamberlain",1]
["RCO","Roy Collard",2]
["RHA","Richard Harris",3]
["RHE","Richard Hennell",3]
["RJ","Roger Jackson",3]
["RN","Roger Nicholls",3]
["RPL","Richard Plackett",1]
["RS","Roger Schofield",3]
["RW","Roger Williams",3]
["SP","Stan Powell",3]
["SS","Steve Sasanow",3]
["TG","Tricia Gilham",3]
["TH","Tony Hill",1]
["TL","Tony Letts",3]
["TR","Toby Roberts",3]
["VC","Val Constable",2]
["WA","Wendy Angseesing",2]

{"sheet":"Tables","index":5,"n_rows":22,"n_cols":11,"rows_kept":22,"cut":false,"hidden":true,"merged":[]}
[]
[null,"Div","Name",null,null,"Match","Date","Home",null,"Home / Away","Home / Away"]
[null,1,"Dawes",null,null,1,"Warks Sep 17","A",null,"H","A"]
[null,2,"Porter",null,null,{"$f":"F3+1","v":2},"Leics Oct 17","H"]
[null,3,"Markham",null,null,{"$f":"F4+1","v":3},"Worcs Nov 17","H"]
[null,null,null,null,null,4,"Derby Jan 18","H"]
[null,null,null,null,null,5,"Notts Feb 18","A"]
[null,null,null,null,null,6,"Staffs Mar 18","H"]
[null,null,null,null,null,7,"Oxf Apr 18","H"]
[null,null,null,null,null,11,"Lei Sep 18","A"]
[null,null,null,null,null,12,"Wor Oct 18","A"]
[null,null,null,null,null,13,"Oxf Nov 18","H"]
[null,null,null,null,null,14," Notts Jan19","H"]
[null,null,null,null,null,15,"Staffs Feb 19","A"]
[null,null,null,null,null,16,"Warks Apr 19","H"]
[null,null,null,null,null,21,"Worcs Sep 19","H"]
[null,null,null,null,null,22,"Oxford Oct 19","A"]
[null,null,null,null,null,23,"Derby Nov 19","H"]
[null,null,null,null,null,24,"Notts Dec 19","A"]
[null,null,null,null,null,25,"Staffs/Shr Jan 20","H"]
[null,null,null,null,null,26,"Warks Feb 20","A"]
[null,null,null,null,null,27,"Leics Apr 20","A"]

{"sheet":"MatchD1","index":6,"n_rows":992,"n_cols":9,"rows_kept":992,"cut":false,"hidden":true,"merged":[]}
["Player1","Player2","Team","Butler","Match","MatchS","Relative","P1","P2"]
["PPE","RCO",1,-48,1,{"$f":"IF(C2=1,VLOOKUP(E2,Pivots!$AX$3:$BA$45,2))/2+IF(C2=2,VLOOKUP(E2,Pivots!$AX$3:$BA$45,3))/2+IF(C2=3,VLOOKUP(E2,Pivots!$AX$3:$BA$45,4))/2","v":-96},{"$f":"IF(A2=\"\",\"\",D2-F2/4)","v":-24},{"$f":"VLOOKUP(A2,Players!$A$2:$B$92,2,FALSE)","v":"Pam Pearce"},{"$f":"VLOOKUP(B2,Players!A$2:$B$92,2,FALSE)","v":"Roy Collard"}]
["RB","GW",1,-52,1,{"$f":"IF(C3=1,VLOOKUP(E3,Pivots!$AX$3:$BA$45,2))/2+IF(C3=2,VLOOKUP(E3,Pivots!$AX$3:$BA$45,3))/2+IF(C3=3,VLOOKUP(E3,Pivots!$AX$3:$BA$45,4))/2","v":-96},-28,{"$f":"VLOOKUP(A3,Players!$A$2:$B$92,2,FALSE)","v":"Richard Butland"},{"$f":"VLOOKUP(B3,Players!A$2:$B$92,2,FALSE)","v":"Gary Watson"}]
["PD","RPL",1,31,1,{"$f":"IF(C4=1,VLOOKUP(E4,Pivots!$AX$3:$BA$45,2))/2+IF(C4=2,VLOOKUP(E4,Pivots!$AX$3:$BA$45,3))/2+IF(C4=3,VLOOKUP(E4,Pivots!$AX$3:$BA$45,4))/2","v":-96},55,{"$f":"VLOOKUP(A4,Players!$A$2:$B$92,2,FALSE)","v":"Paul Denning"},{"$f":"VLOOKUP(B4,Players!A$2:$B$92,2,FALSE)","v":"Richard Plackett"}]
["RHA","TG",1,-27,1,{"$f":"IF(C5=1,VLOOKUP(E5,Pivots!$AX$3:$BA$45,2))/2+IF(C5=2,VLOOKUP(E5,Pivots!$AX$3:$BA$45,3))/2+IF(C5=3,VLOOKUP(E5,Pivots!$AX$3:$BA$45,4))/2","v":-96},-3,{"$f":"VLOOKUP(A5,Players!$A$2:$B$92,2,FALSE)","v":"Richard Harris"},{"$f":"VLOOKUP(B5,Players!A$2:$B$92,2,FALSE)","v":"Tricia Gilham"}]
["APR","DA",2,-2,1,{"$f":"IF(C6=1,VLOOKUP(E6,Pivots!$AX$3:$BA$45,2))/2+IF(C6=2,VLOOKUP(E6,Pivots!$AX$3:$BA$45,3))/2+IF(C6=3,VLOOKUP(E6,Pivots!$AX$3:$BA$45,4))/2","v":-37},7.25,{"$f":"VLOOKUP(A6,Players!$A$2:$B$92,2,FALSE)","v":"Alison Pritchard"},{"$f":"VLOOKUP(B6,Players!A$2:$B$92,2,FALSE)","v":"David Atthey"}]
["AKA","DS",2,37,1,{"$f":"IF(C7=1,VLOOKUP(E7,Pivots!$AX$3:$BA$45,2))/2+IF(C7=2,VLOOKUP(E7,Pivots!$AX$3:$BA$45,3))/2+IF(C7=3,VLOOKUP(E7,Pivots!$AX$3:$BA$45,4))/2","v":-37},46.25,{"$f":"VLOOKUP(A7,Players!$A$2:$B$92,2,FALSE)","v":"Ashok Kwatra"},{"$f":"VLOOKUP(B7,Players!A$2:$B$92,2,FALSE)","v":"David Simons"}]
["TL","RS",2,-27,1,{"$f":"IF(C8=1,VLOOKUP(E8,Pivots!$AX$3:$BA$45,2))/2+IF(C8=2,VLOOKUP(E8,Pivots!$AX$3:$BA$45,3))/2+IF(C8=3,VLOOKUP(E8,Pivots!$AX$3:$BA$45,4))/2","v":-37},-17.75,{"$f":"VLOOKUP(A8,Players!$A$2:$B$92,2,FALSE)","v":"Tony Letts"},{"$f":"VLOOKUP(B8,Players!A$2:$B$92,2,FALSE)","v":"Roger Schofield"}]
["PW","PPH",2,-45,1,{"$f":"IF(C9=1,VLOOKUP(E9,Pivots!$AX$3:$BA$45,2))/2+IF(C9=2,VLOOKUP(E9,Pivots!$AX$3:$BA$45,3))/2+IF(C9=3,VLOOKUP(E9,Pivots!$AX$3:$BA$45,4))/2","v":-37},-35.75,{"$f":"VLOOKUP(A9,Players!$A$2:$B$92,2,FALSE)","v":"Peter Waggett"},{"$f":"VLOOKUP(B9,Players!A$2:$B$92,2,FALSE)","v":"Patrick Phair"}]
["IC","VC",3,-14,1,{"$f":"IF(C10=1,VLOOKUP(E10,Pivots!$AX$3:$BA$45,2))/2+IF(C10=2,VLOOKUP(E10,Pivots!$AX$3:$BA$45,3))/2+IF(C10=3,VLOOKUP(E10,Pivots!$AX$3:$BA$45,4))/2","v":2},-14.5,{"$f":"VLOOKUP(A10,Players!$A$2:$B$92,2,FALSE)","v":"Ian Constable"},{"$f":"VLOOKUP(B10,Players!A$2:$B$92,2,FALSE)","v":"Val Constable"}]
["PSW","LH",3,19,1,{"$f":"IF(C11=1,VLOOKUP(E11,Pivots!$AX$3:$BA$45,2))/2+IF(C11=2,VLOOKUP(E11,Pivots!$AX$3:$BA$45,3))/2+IF(C11=3,VLOOKUP(E11,Pivots!$AX$3:$BA$45,4))/2","v":2},18.5,{"$f":"VLOOKUP(A11,Players!$A$2:$B$92,2,FALSE)","v":"Peter Swales"},{"$f":"VLOOKUP(B11,Players!A$2:$B$92,2,FALSE)","v":"Lesley Harrison"}]
["AS","JUS",3,6,1,{"$f":"IF(C12=1,VLOOKUP(E12,Pivots!$AX$3:$BA$45,2))/2+IF(C12=2,VLOOKUP(E12,Pivots!$AX$3:$BA$45,3))/2+IF(C12=3,VLOOKUP(E12,Pivots!$AX$3:$BA$45,4))/2","v":2},5.5,{"$f":"VLOOKUP(A12,Players!$A$2:$B$92,2,FALSE)","v":"Allan Sanis"},{"$f":"VLOOKUP(B12,Players!A$2:$B$92,2,FALSE)","v":"Judy Sanis"}]
["RW","KAS",3,-9,1,{"$f":"IF(C13=1,VLOOKUP(E13,Pivots!$AX$3:$BA$45,2))/2+IF(C13=2,VLOOKUP(E13,Pivots!$AX$3:$BA$45,3))/2+IF(C13=3,VLOOKUP(E13,Pivots!$AX$3:$BA$45,4))/2","v":2},-9.5,{"$f":"VLOOKUP(A13,Players!$A$2:$B$92,2,FALSE)","v":"Roger Williams"},{"$f":"VLOOKUP(B13,Players!A$2:$B$92,2,FALSE)","v":"Anne Swannell"}]
["PSH","RCM",1,59,2,{"$f":"IF(C14=1,VLOOKUP(E14,Pivots!$AX$3:$BA$45,2))/2+IF(C14=2,VLOOKUP(E14,Pivots!$AX$3:$BA$45,3))/2+IF(C14=3,VLOOKUP(E14,Pivots!$AX$3:$BA$45,4))/2","v":123},28.25,{"$f":"VLOOKUP(A14,Players!$A$2:$B$92,2,FALSE)","v":"Patrick Shields"},{"$f":"VLOOKUP(B14,Players!A$2:$B$92,2,FALSE)","v":"Richard Chamberlain"}]
["JAN","KST",1,37,2,{"$f":"IF(C15=1,VLOOKUP(E15,Pivots!$AX$3:$BA$45,2))/2+IF(C15=2,VLOOKUP(E15,Pivots!$AX$3:$BA$45,3))/2+IF(C15=3,VLOOKUP(E15,Pivots!$AX$3:$BA$45,4))/2","v":123},6.25,{"$f":"VLOOKUP(A15,Players!$A$2:$B$92,2,FALSE)","v":"Joe Angseesing"},{"$f":"VLOOKUP(B15,Players!A$2:$B$92,2,FALSE)","v":"Keith Stanley"}]
["PD","RPL",1,30,2,{"$f":"IF(C16=1,VLOOKUP(E16,Pivots!$AX$3:$BA$45,2))/2+IF(C16=2,VLOOKUP(E16,Pivots!$AX$3:$BA$45,3))/2+IF(C16=3,VLOOKUP(E16,Pivots!$AX$3:$BA$45,4))/2","v":123},-0.75,{"$f":"VLOOKUP(A16,Players!$A$2:$B$92,2,FALSE)","v":"Paul Denning"},{"$f":"VLOOKUP(B16,Players!A$2:$B$92,2,FALSE)","v":"Richard Plackett"}]
["GW","JAT",1,-3,2,{"$f":"IF(C17=1,VLOOKUP(E17,Pivots!$AX$3:$BA$45,2))/2+IF(C17=2,VLOOKUP(E17,Pivots!$AX$3:$BA$45,3))/2+IF(C17=3,VLOOKUP(E17,Pivots!$AX$3:$BA$45,4))/2","v":123},-33.75,{"$f":"VLOOKUP(A17,Players!$A$2:$B$92,2,FALSE)","v":"Gary Watson"},{"$f":"VLOOKUP(B17,Players!A$2:$B$92,2,FALSE)","v":"John Atthey"}]
["PW","MR",2,71,2,{"$f":"IF(C18=1,VLOOKUP(E18,Pivots!$AX$3:$BA$45,2))/2+IF(C18=2,VLOOKUP(E18,Pivots!$AX$3:$BA$45,3))/2+IF(C18=3,VLOOKUP(E18,Pivots!$AX$3:$BA$45,4))/2","v":129},38.75,{"$f":"VLOOKUP(A18,Players!$A$2:$B$92,2,FALSE)","v":"Peter Waggett"},{"$f":"VLOOKUP(B18,Players!A$2:$B$92,2,FALSE)","v":"Mark Rogers"}]
["RCO","PPE",2,49,2,{"$f":"IF(C19=1,VLOOKUP(E19,Pivots!$AX$3:$BA$45,2))/2+IF(C19=2,VLOOKUP(E19,Pivots!$AX$3:$BA$45,3))/2+IF(C19=3,VLOOKUP(E19,Pivots!$AX$3:$BA$45,4))/2","v":129},16.75,{"$f":"VLOOKUP(A19,Players!$A$2:$B$92,2,FALSE)","v":"Roy Collard"},{"$f":"VLOOKUP(B19,Players!A$2:$B$92,2,FALSE)","v":"Pam Pearce"}]
["JSI","PPH",2,5,2,{"$f":"IF(C20=1,VLOOKUP(E20,Pivots!$AX$3:$BA$45,2))/2+IF(C20=2,VLOOKUP(E20,Pivots!$AX$3:$BA$45,3))/2+IF(C20=3,VLOOKUP(E20,Pivots!$AX$3:$BA$45,4))/2","v":129},-27.25,{"$f":"VLOOKUP(A20,Players!$A$2:$B$92,2,FALSE)","v":"Jim Simons"},{"$f":"VLOOKUP(B20,Players!A$2:$B$92,2,FALSE)","v":"Patrick Phair"}]
["TG","RHA",2,4,2,{"$f":"IF(C21=1,VLOOKUP(E21,Pivots!$AX$3:$BA$45,2))/2+IF(C21=2,VLOOKUP(E21,Pivots!$AX$3:$BA$45,3))/2+IF(C21=3,VLOOKUP(E21,Pivots!$AX$3:$BA$45,4))/2","v":129},-28.25,{"$f":"VLOOKUP(A21,Players!$A$2:$B$92,2,FALSE)","v":"Tricia Gilham"},{"$f":"VLOOKUP(B21,Players!A$2:$B$92,2,FALSE)","v":"Richard Harris"}]
["JAR","MB",3,62,2,{"$f":"IF(C22=1,VLOOKUP(E22,Pivots!$AX$3:$BA$45,2))/2+IF(C22=2,VLOOKUP(E22,Pivots!$AX$3:$BA$45,3))/2+IF(C22=3,VLOOKUP(E22,Pivots!$AX$3:$BA$45,4))/2","v":61},46.75,{"$f":"VLOOKUP(A22,Players!$A$2:$B$92,2,FALSE)","v":"John Arblaster"},{"$f":"VLOOKUP(B22,Players!A$2:$B$92,2,FALSE)","v":"Mel Barlow"}]
["IC","VC",3,5,2,{"$f":"IF(C23=1,VLOOKUP(E23,Pivots!$AX$3:$BA$45,2))/2+IF(C23=2,VLOOKUP(E23,Pivots!$AX$3:$BA$45,3))/2+IF(C23=3,VLOOKUP(E23,Pivots!$AX$3:$BA$45,4))/2","v":61},-10.25,{"$f":"VLOOKUP(A23,Players!$A$2:$B$92,2,FALSE)","v":"Ian Constable"},{"$f":"VLOOKUP(B23,Players!A$2:$B$92,2,FALSE)","v":"Val Constable"}]
["AKA","DS",3,-1,2,{"$f":"IF(C24=1,VLOOKUP(E24,Pivots!$AX$3:$BA$45,2))/2+IF(C24=2,VLOOKUP(E24,Pivots!$AX$3:$BA$45,3))/2+IF(C24=3,VLOOKUP(E24,Pivots!$AX$3:$BA$45,4))/2","v":61},-16.25,{"$f":"VLOOKUP(A24,Players!$A$2:$B$92,2,FALSE)","v":"Ashok Kwatra"},{"$f":"VLOOKUP(B24,Players!A$2:$B$92,2,FALSE)","v":"David Simons"}]
["WA","MW",3,-5,2,{"$f":"IF(C25=1,VLOOKUP(E25,Pivots!$AX$3:$BA$45,2))/2+IF(C25=2,VLOOKUP(E25,Pivots!$AX$3:$BA$45,3))/2+IF(C25=3,VLOOKUP(E25,Pivots!$AX$3:$BA$45,4))/2","v":61},-20.25,{"$f":"VLOOKUP(A25,Players!$A$2:$B$92,2,FALSE)","v":"Wendy Angseesing"},{"$f":"VLOOKUP(B25,Players!A$2:$B$92,2,FALSE)","v":"Mike Wignall"}]
["PSH","RCM",1,26,3,{"$f":"IF(C26=1,VLOOKUP(E26,Pivots!$AX$3:$BA$45,2))/2+IF(C26=2,VLOOKUP(E26,Pivots!$AX$3:$BA$45,3))/2+IF(C26=3,VLOOKUP(E26,Pivots!$AX$3:$BA$45,4))/2","v":42},15.5,{"$f":"VLOOKUP(A26,Players!$A$2:$B$92,2,FALSE)","v":"Patrick Shields"},{"$f":"VLOOKUP(B26,Players!A$2:$B$92,2,FALSE)","v":"Richard Chamberlain"}]
["PD","RPL",1,20,3,{"$f":"IF(C27=1,VLOOKUP(E27,Pivots!$AX$3:$BA$45,2))/2+IF(C27=2,VLOOKUP(E27,Pivots!$AX$3:$BA$45,3))/2+IF(C27=3,VLOOKUP(E27,Pivots!$AX$3:$BA$45,4))/2","v":42},9.5,{"$f":"VLOOKUP(A27,Players!$A$2:$B$92,2,FALSE)","v":"Paul Denning"},{"$f":"VLOOKUP(B27,Players!A$2:$B$92,2,FALSE)","v":"Richard Plackett"}]
["JAN","WA",1,9,3,{"$f":"IF(C28=1,VLOOKUP(E28,Pivots!$AX$3:$BA$45,2))/2+IF(C28=2,VLOOKUP(E28,Pivots!$AX$3:$BA$45,3))/2+IF(C28=3,VLOOKUP(E28,Pivots!$AX$3:$BA$45,4))/2","v":42},-1.5,{"$f":"VLOOKUP(A28,Players!$A$2:$B$92,2,FALSE)","v":"Joe Angseesing"},{"$f":"VLOOKUP(B28,Players!A$2:$B$92,2,FALSE)","v":"Wendy Angseesing"}]
["GW","RB",1,-13,3,{"$f":"IF(C29=1,VLOOKUP(E29,Pivots!$AX$3:$BA$45,2))/2+IF(C29=2,VLOOKUP(E29,Pivots!$AX$3:$BA$45,3))/2+IF(C29=3,VLOOKUP(E29,Pivots!$AX$3:$BA$45,4))/2","v":42},-23.5,{"$f":"VLOOKUP(A29,Players!$A$2:$B$92,2,FALSE)","v":"Gary Watson"},{"$f":"VLOOKUP(B29,Players!A$2:$B$92,2,FALSE)","v":"Richard Butland"}]
["PW","MR",2,25,3,{"$f":"IF(C30=1,VLOOKUP(E30,Pivots!$AX$3:$BA$45,2))/2+IF(C30=2,VLOOKUP(E30,Pivots!$AX$3:$BA$45,3))/2+IF(C30=3,VLOOKUP(E30,Pivots!$AX$3:$BA$45,4))/2","v":42},14.5,{"$f":"VLOOKUP(A30,Players!$A$2:$B$92,2,FALSE)","v":"Peter Waggett"},{"$f":"VLOOKUP(B30,Players!A$2:$B$92,2,FALSE)","v":"Mark Rogers"}]
["PPE","RCO",2,12,3,{"$f":"IF(C31=1,VLOOKUP(E31,Pivots!$AX$3:$BA$45,2))/2+IF(C31=2,VLOOKUP(E31,Pivots!$AX$3:$BA$45,3))/2+IF(C31=3,VLOOKUP(E31,Pivots!$AX$3:$BA$45,4))/2","v":42},1.5,{"$f":"VLOOKUP(A31,Players!$A$2:$B$92,2,FALSE)","v":"Pam Pearce"},{"$f":"VLOOKUP(B31,Players!A$2:$B$92,2,FALSE)","v":"Roy Collard"}]
["TG","RHA",2,10,3,{"$f":"IF(C32=1,VLOOKUP(E32,Pivots!$AX$3:$BA$45,2))/2+IF(C32=2,VLOOKUP(E32,Pivots!$AX$3:$BA$45,3))/2+IF(C32=3,VLOOKUP(E32,Pivots!$AX$3:$BA$45,4))/2","v":42},-0.5,{"$f":"VLOOKUP(A32,Players!$A$2:$B$92,2,FALSE)","v":"Tricia Gilham"},{"$f":"VLOOKUP(B32,Players!A$2:$B$92,2,FALSE)","v":"Richard Harris"}]
["JSI","PPH",2,-5,3,{"$f":"IF(C33=1,VLOOKUP(E33,Pivots!$AX$3:$BA$45,2))/2+IF(C33=2,VLOOKUP(E33,Pivots!$AX$3:$BA$45,3))/2+IF(C33=3,VLOOKUP(E33,Pivots!$AX$3:$BA$45,4))/2","v":42},-15.5,{"$f":"VLOOKUP(A33,Players!$A$2:$B$92,2,FALSE)","v":"Jim Simons"},{"$f":"VLOOKUP(B33,Players!A$2:$B$92,2,FALSE)","v":"Patrick Phair"}]
["KAS","PSW",3,27,3,{"$f":"IF(C34=1,VLOOKUP(E34,Pivots!$AX$3:$BA$45,2))/2+IF(C34=2,VLOOKUP(E34,Pivots!$AX$3:$BA$45,3))/2+IF(C34=3,VLOOKUP(E34,Pivots!$AX$3:$BA$45,4))/2","v":3},26.25,{"$f":"VLOOKUP(A34,Players!$A$2:$B$92,2,FALSE)","v":"Anne Swannell"},{"$f":"VLOOKUP(B34,Players!A$2:$B$92,2,FALSE)","v":"Peter Swales"}]
["VC","IC",3,12,3,{"$f":"IF(C35=1,VLOOKUP(E35,Pivots!$AX$3:$BA$45,2))/2+IF(C35=2,VLOOKUP(E35,Pivots!$AX$3:$BA$45,3))/2+IF(C35=3,VLOOKUP(E35,Pivots!$AX$3:$BA$45,4))/2","v":3},11.25,{"$f":"VLOOKUP(A35,Players!$A$2:$B$92,2,FALSE)","v":"Val Constable"},{"$f":"VLOOKUP(B35,Players!A$2:$B$92,2,FALSE)","v":"Ian Constable"}]
["AS","JUS",3,-20,3,{"$f":"IF(C36=1,VLOOKUP(E36,Pivots!$AX$3:$BA$45,2))/2+IF(C36=2,VLOOKUP(E36,Pivots!$AX$3:$BA$45,3))/2+IF(C36=3,VLOOKUP(E36,Pivots!$AX$3:$BA$45,4))/2","v":3},-20.75,{"$f":"VLOOKUP(A36,Players!$A$2:$B$92,2,FALSE)","v":"Allan Sanis"},{"$f":"VLOOKUP(B36,Players!A$2:$B$92,2,FALSE)","v":"Judy Sanis"}]
["APR","DA",3,-16,3,{"$f":"IF(C37=1,VLOOKUP(E37,Pivots!$AX$3:$BA$45,2))/2+IF(C37=2,VLOOKUP(E37,Pivots!$AX$3:$BA$45,3))/2+IF(C37=3,VLOOKUP(E37,Pivots!$AX$3:$BA$45,4))/2","v":3},-16.75,{"$f":"VLOOKUP(A37,Players!$A$2:$B$92,2,FALSE)","v":"Alison Pritchard"},{"$f":"VLOOKUP(B37,Players!A$2:$B$92,2,FALSE)","v":"David Atthey"}]
["PD","RPL",1,29,4,{"$f":"IF(C38=1,VLOOKUP(E38,Pivots!$AX$3:$BA$45,2))/2+IF(C38=2,VLOOKUP(E38,Pivots!$AX$3:$BA$45,3))/2+IF(C38=3,VLOOKUP(E38,Pivots!$AX$3:$BA$45,4))/2","v":50},16.5,{"$f":"VLOOKUP(A38,Players!$A$2:$B$92,2,FALSE)","v":"Paul Denning"},{"$f":"VLOOKUP(B38,Players!A$2:$B$92,2,FALSE)","v":"Richard Plackett"}]
["AKM","RCM",1,24,4,{"$f":"IF(C39=1,VLOOKUP(E39,Pivots!$AX$3:$BA$45,2))/2+IF(C39=2,VLOOKUP(E39,Pivots!$AX$3:$BA$45,3))/2+IF(C39=3,VLOOKUP(E39,Pivots!$AX$3:$BA$45,4))/2","v":50},11.5,{"$f":"VLOOKUP(A39,Players!$A$2:$B$92,2,FALSE)","v":"Andrew Kambites"},{"$f":"VLOOKUP(B39,Players!A$2:$B$92,2,FALSE)","v":"Richard Chamberlain"}]
["PSH","GW",1,20,4,{"$f":"IF(C40=1,VLOOKUP(E40,Pivots!$AX$3:$BA$45,2))/2+IF(C40=2,VLOOKUP(E40,Pivots!$AX$3:$BA$45,3))/2+IF(C40=3,VLOOKUP(E40,Pivots!$AX$3:$BA$45,4))/2","v":50},7.5,{"$f":"VLOOKUP(A40,Players!$A$2:$B$92,2,FALSE)","v":"Patrick Shields"},{"$f":"VLOOKUP(B40,Players!A$2:$B$92,2,FALSE)","v":"Gary Watson"}]
["DN","BY",1,-23,4,{"$f":"IF(C41=1,VLOOKUP(E41,Pivots!$AX$3:$BA$45,2))/2+IF(C41=2,VLOOKUP(E41,Pivots!$AX$3:$BA$45,3))/2+IF(C41=3,VLOOKUP(E41,Pivots!$AX$3:$BA$45,4))/2","v":50},-35.5,{"$f":"VLOOKUP(A41,Players!$A$2:$B$92,2,FALSE)","v":"Diana Nettleton"},{"$f":"VLOOKUP(B41,Players!A$2:$B$92,2,FALSE)","v":"Bryony Youngs"}]
["JSI","PPH",2,30,4,{"$f":"IF(C42=1,VLOOKUP(E42,Pivots!$AX$3:$BA$45,2))/2+IF(C42=2,VLOOKUP(E42,Pivots!$AX$3:$BA$45,3))/2+IF(C42=3,VLOOKUP(E42,Pivots!$AX$3:$BA$45,4))/2","v":28},23,{"$f":"VLOOKUP(A42,Players!$A$2:$B$92,2,FALSE)","v":"Jim Simons"},{"$f":"VLOOKUP(B42,Players!A$2:$B$92,2,FALSE)","v":"Patrick Phair"}]
["TG","RHA",2,-20,4,{"$f":"IF(C43=1,VLOOKUP(E43,Pivots!$AX$3:$BA$45,2))/2+IF(C43=2,VLOOKUP(E43,Pivots!$AX$3:$BA$45,3))/2+IF(C43=3,VLOOKUP(E43,Pivots!$AX$3:$BA$45,4))/2","v":28},-27,{"$f":"VLOOKUP(A43,Players!$A$2:$B$92,2,FALSE)","v":"Tricia Gilham"},{"$f":"VLOOKUP(B43,Players!A$2:$B$92,2,FALSE)","v":"Richard Harris"}]
["IC","VC",2,7,4,{"$f":"IF(C44=1,VLOOKUP(E44,Pivots!$AX$3:$BA$45,2))/2+IF(C44=2,VLOOKUP(E44,Pivots!$AX$3:$BA$45,3))/2+IF(C44=3,VLOOKUP(E44,Pivots!$AX$3:$BA$45,4))/2","v":28},0,{"$f":"VLOOKUP(A44,Players!$A$2:$B$92,2,FALSE)","v":"Ian Constable"},{"$f":"VLOOKUP(B44,Players!A$2:$B$92,2,FALSE)","v":"Val Constable"}]
["PPE","RCO",2,11,4,{"$f":"IF(C45=1,VLOOKUP(E45,Pivots!$AX$3:$BA$45,2))/2+IF(C45=2,VLOOKUP(E45,Pivots!$AX$3:$BA$45,3))/2+IF(C45=3,VLOOKUP(E45,Pivots!$AX$3:$BA$45,4))/2","v":28},4,{"$f":"VLOOKUP(A45,Players!$A$2:$B$92,2,FALSE)","v":"Pam Pearce"},{"$f":"VLOOKUP(B45,Players!A$2:$B$92,2,FALSE)","v":"Roy Collard"}]
["DA","APR",3,-18,4,{"$f":"IF(C46=1,VLOOKUP(E46,Pivots!$AX$3:$BA$45,2))/2+IF(C46=2,VLOOKUP(E46,Pivots!$AX$3:$BA$45,3))/2+IF(C46=3,VLOOKUP(E46,Pivots!$AX$3:$BA$45,4))/2","v":-14},-14.5,{"$f":"VLOOKUP(A46,Players!$A$2:$B$92,2,FALSE)","v":"David Atthey"},{"$f":"VLOOKUP(B46,Players!A$2:$B$92,2,FALSE)","v":"Alison Pritchard"}]
["PW","RJ",3,-8,4,{"$f":"IF(C47=1,VLOOKUP(E47,Pivots!$AX$3:$BA$45,2))/2+IF(C47=2,VLOOKUP(E47,Pivots!$AX$3:$BA$45,3))/2+IF(C47=3,VLOOKUP(E47,Pivots!$AX$3:$BA$45,4))/2","v":-14},-4.5,{"$f":"VLOOKUP(A47,Players!$A$2:$B$92,2,FALSE)","v":"Peter Waggett"},{"$f":"VLOOKUP(B47,Players!A$2:$B$92,2,FALSE)","v":"Roger Jackson"}]
["AKA","LH",3,-5,4,{"$f":"IF(C48=1,VLOOKUP(E48,Pivots!$AX$3:$BA$45,2))/2+IF(C48=2,VLOOKUP(E48,Pivots!$AX$3:$BA$45,3))/2+IF(C48=3,VLOOKUP(E48,Pivots!$AX$3:$BA$45,4))/2","v":-14},-1.5,{"$f":"VLOOKUP(A48,Players!$A$2:$B$92,2,FALSE)","v":"Ashok Kwatra"},{"$f":"VLOOKUP(B48,Players!A$2:$B$92,2,FALSE)","v":"Lesley Harrison"}]
["MR","JC",3,17,4,{"$f":"IF(C49=1,VLOOKUP(E49,Pivots!$AX$3:$BA$45,2))/2+IF(C49=2,VLOOKUP(E49,Pivots!$AX$3:$BA$45,3))/2+IF(C49=3,VLOOKUP(E49,Pivots!$AX$3:$BA$45,4))/2","v":-14},20.5,{"$f":"VLOOKUP(A49,Players!$A$2:$B$92,2,FALSE)","v":"Mark Rogers"},{"$f":"VLOOKUP(B49,Players!A$2:$B$92,2,FALSE)","v":"John Councer"}]
["RB","GW",1,37,5,{"$f":"IF(C50=1,VLOOKUP(E50,Pivots!$AX$3:$BA$45,2))/2+IF(C50=2,VLOOKUP(E50,Pivots!$AX$3:$BA$45,3))/2+IF(C50=3,VLOOKUP(E50,Pivots!$AX$3:$BA$45,4))/2","v":61},21.75,{"$f":"VLOOKUP(A50,Players!$A$2:$B$92,2,FALSE)","v":"Richard Butland"},{"$f":"VLOOKUP(B50,Players!A$2:$B$92,2,FALSE)","v":"Gary Watson"}]
["PD","BY",1,46,5,{"$f":"IF(C51=1,VLOOKUP(E51,Pivots!$AX$3:$BA$45,2))/2+IF(C51=2,VLOOKUP(E51,Pivots!$AX$3:$BA$45,3))/2+IF(C51=3,VLOOKUP(E51,Pivots!$AX$3:$BA$45,4))/2","v":61},30.75,{"$f":"VLOOKUP(A51,Players!$A$2:$B$92,2,FALSE)","v":"Paul Denning"},{"$f":"VLOOKUP(B51,Players!A$2:$B$92,2,FALSE)","v":"Bryony Youngs"}]
["PSH","RCM",1,18,5,{"$f":"IF(C52=1,VLOOKUP(E52,Pivots!$AX$3:$BA$45,2))/2+IF(C52=2,VLOOKUP(E52,Pivots!$AX$3:$BA$45,3))/2+IF(C52=3,VLOOKUP(E52,Pivots!$AX$3:$BA$45,4))/2","v":61},2.75,{"$f":"VLOOKUP(A52,Players!$A$2:$B$92,2,FALSE)","v":"Patrick Shields"},{"$f":"VLOOKUP(B52,Players!A$2:$B$92,2,FALSE)","v":"Richard Chamberlain"}]
["JAN","KST",1,-40,5,{"$f":"IF(C53=1,VLOOKUP(E53,Pivots!$AX$3:$BA$45,2))/2+IF(C53=2,VLOOKUP(E53,Pivots!$AX$3:$BA$45,3))/2+IF(C53=3,VLOOKUP(E53,Pivots!$AX$3:$BA$45,4))/2","v":61},-55.25,{"$f":"VLOOKUP(A53,Players!$A$2:$B$92,2,FALSE)","v":"Joe Angseesing"},{"$f":"VLOOKUP(B53,Players!A$2:$B$92,2,FALSE)","v":"Keith Stanley"}]
["RHA","TG",2,-21,5,{"$f":"IF(C54=1,VLOOKUP(E54,Pivots!$AX$3:$BA$45,2))/2+IF(C54=2,VLOOKUP(E54,Pivots!$AX$3:$BA$45,3))/2+IF(C54=3,VLOOKUP(E54,Pivots!$AX$3:$BA$45,4))/2","v":10},-23.5,{"$f":"VLOOKUP(A54,Players!$A$2:$B$92,2,FALSE)","v":"Richard Harris"},{"$f":"VLOOKUP(B54,Players!A$2:$B$92,2,FALSE)","v":"Tricia Gilham"}]
["IC","AS",2,13,5,{"$f":"IF(C55=1,VLOOKUP(E55,Pivots!$AX$3:$BA$45,2))/2+IF(C55=2,VLOOKUP(E55,Pivots!$AX$3:$BA$45,3))/2+IF(C55=3,VLOOKUP(E55,Pivots!$AX$3:$BA$45,4))/2","v":10},10.5,{"$f":"VLOOKUP(A55,Players!$A$2:$B$92,2,FALSE)","v":"Ian Constable"},{"$f":"VLOOKUP(B55,Players!A$2:$B$92,2,FALSE)","v":"Allan Sanis"}]
["WA","MW",2,22,5,{"$f":"IF(C56=1,VLOOKUP(E56,Pivots!$AX$3:$BA$45,2))/2+IF(C56=2,VLOOKUP(E56,Pivots!$AX$3:$BA$45,3))/2+IF(C56=3,VLOOKUP(E56,Pivots!$AX$3:$BA$45,4))/2","v":10},19.5,{"$f":"VLOOKUP(A56,Players!$A$2:$B$92,2,FALSE)","v":"Wendy Angseesing"},{"$f":"VLOOKUP(B56,Players!A$2:$B$92,2,FALSE)","v":"Mike Wignall"}]
["PPH","JSI",2,-4,5,{"$f":"IF(C57=1,VLOOKUP(E57,Pivots!$AX$3:$BA$45,2))/2+IF(C57=2,VLOOKUP(E57,Pivots!$AX$3:$BA$45,3))/2+IF(C57=3,VLOOKUP(E57,Pivots!$AX$3:$BA$45,4))/2","v":10},-6.5,{"$f":"VLOOKUP(A57,Players!$A$2:$B$92,2,FALSE)","v":"Patrick Phair"},{"$f":"VLOOKUP(B57,Players!A$2:$B$92,2,FALSE)","v":"Jim Simons"}]
["LH","PSW",3,6,5,{"$f":"IF(C58=1,VLOOKUP(E58,Pivots!$AX$3:$BA$45,2))/2+IF(C58=2,VLOOKUP(E58,Pivots!$AX$3:$BA$45,3))/2+IF(C58=3,VLOOKUP(E58,Pivots!$AX$3:$BA$45,4))/2","v":-13},9.25,{"$f":"VLOOKUP(A58,Players!$A$2:$B$92,2,FALSE)","v":"Lesley Harrison"},{"$f":"VLOOKUP(B58,Players!A$2:$B$92,2,FALSE)","v":"Peter Swales"}]
["RJ","PW",3,7,5,{"$f":"IF(C59=1,VLOOKUP(E59,Pivots!$AX$3:$BA$45,2))/2+IF(C59=2,VLOOKUP(E59,Pivots!$AX$3:$BA$45,3))/2+IF(C59=3,VLOOKUP(E59,Pivots!$AX$3:$BA$45,4))/2","v":-13},10.25,{"$f":"VLOOKUP(A59,Players!$A$2:$B$92,2,FALSE)","v":"Roger Jackson"},{"$f":"VLOOKUP(B59,Players!A$2:$B$92,2,FALSE)","v":"Peter Waggett"}]
["SP","APO",3,-33,5,{"$f":"IF(C60=1,VLOOKUP(E60,Pivots!$AX$3:$BA$45,2))/2+IF(C60=2,VLOOKUP(E60,Pivots!$AX$3:$BA$45,3))/2+IF(C60=3,VLOOKUP(E60,Pivots!$AX$3:$BA$45,4))/2","v":-13},-29.75,{"$f":"VLOOKUP(A60,Players!$A$2:$B$92,2,FALSE)","v":"Stan Powell"},{"$f":"VLOOKUP(B60,Players!A$2:$B$92,2,FALSE)","v":"Andrea Powell"}]
["KAS","RW",3,7,5,{"$f":"IF(C61=1,VLOOKUP(E61,Pivots!$AX$3:$BA$45,2))/2+IF(C61=2,VLOOKUP(E61,Pivots!$AX$3:$BA$45,3))/2+IF(C61=3,VLOOKUP(E61,Pivots!$AX$3:$BA$45,4))/2","v":-13},10.25,{"$f":"VLOOKUP(A61,Players!$A$2:$B$92,2,FALSE)","v":"Anne Swannell"},{"$f":"VLOOKUP(B61,Players!A$2:$B$92,2,FALSE)","v":"Roger Williams"}]
["PD","RPL",1,57,6,{"$f":"IF(C62=1,VLOOKUP(E62,Pivots!$AX$3:$BA$45,2))/2+IF(C62=2,VLOOKUP(E62,Pivots!$AX$3:$BA$45,3))/2+IF(C62=3,VLOOKUP(E62,Pivots!$AX$3:$BA$45,4))/2","v":76},38,{"$f":"VLOOKUP(A62,Players!$A$2:$B$92,2,FALSE)","v":"Paul Denning"},{"$f":"VLOOKUP(B62,Players!A$2:$B$92,2,FALSE)","v":"Richard Plackett"}]
["KST","JAN",1,-29,6,{"$f":"IF(C63=1,VLOOKUP(E63,Pivots!$AX$3:$BA$45,2))/2+IF(C63=2,VLOOKUP(E63,Pivots!$AX$3:$BA$45,3))/2+IF(C63=3,VLOOKUP(E63,Pivots!$AX$3:$BA$45,4))/2","v":76},-48,{"$f":"VLOOKUP(A63,Players!$A$2:$B$92,2,FALSE)","v":"Keith Stanley"},{"$f":"VLOOKUP(B63,Players!A$2:$B$92,2,FALSE)","v":"Joe Angseesing"}]
["GW","RB",1,16,6,{"$f":"IF(C64=1,VLOOKUP(E64,Pivots!$AX$3:$BA$45,2))/2+IF(C64=2,VLOOKUP(E64,Pivots!$AX$3:$BA$45,3))/2+IF(C64=3,VLOOKUP(E64,Pivots!$AX$3:$BA$45,4))/2","v":76},-3,{"$f":"VLOOKUP(A64,Players!$A$2:$B$92,2,FALSE)","v":"Gary Watson"},{"$f":"VLOOKUP(B64,Players!A$2:$B$92,2,FALSE)","v":"Richard Butland"}]
["PSH","RCM",1,32,6,{"$f":"IF(C65=1,VLOOKUP(E65,Pivots!$AX$3:$BA$45,2))/2+IF(C65=2,VLOOKUP(E65,Pivots!$AX$3:$BA$45,3))/2+IF(C65=3,VLOOKUP(E65,Pivots!$AX$3:$BA$45,4))/2","v":76},13,{"$f":"VLOOKUP(A65,Players!$A$2:$B$92,2,FALSE)","v":"Patrick Shields"},{"$f":"VLOOKUP(B65,Players!A$2:$B$92,2,FALSE)","v":"Richard Chamberlain"}]
["MW","WA",2,44,6,{"$f":"IF(C66=1,VLOOKUP(E66,Pivots!$AX$3:$BA$45,2))/2+IF(C66=2,VLOOKUP(E66,Pivots!$AX$3:$BA$45,3))/2+IF(C66=3,VLOOKUP(E66,Pivots!$AX$3:$BA$45,4))/2","v":121},{"$f":"IF(A66=\"\",\"\",D66-F66/4)","v":13.75},{"$f":"VLOOKUP(A66,Players!$A$2:$B$92,2,FALSE)","v":"Mike Wignall"},{"$f":"VLOOKUP(B66,Players!A$2:$B$92,2,FALSE)","v":"Wendy Angseesing"}]
["IC","VC",2,38,6,{"$f":"IF(C67=1,VLOOKUP(E67,Pivots!$AX$3:$BA$45,2))/2+IF(C67=2,VLOOKUP(E67,Pivots!$AX$3:$BA$45,3))/2+IF(C67=3,VLOOKUP(E67,Pivots!$AX$3:$BA$45,4))/2","v":121},7.75,{"$f":"VLOOKUP(A67,Players!$A$2:$B$92,2,FALSE)","v":"Ian Constable"},{"$f":"VLOOKUP(B67,Players!A$2:$B$92,2,FALSE)","v":"Val Constable"}]
["PPH","JSI",2,10,6,{"$f":"IF(C68=1,VLOOKUP(E68,Pivots!$AX$3:$BA$45,2))/2+IF(C68=2,VLOOKUP(E68,Pivots!$AX$3:$BA$45,3))/2+IF(C68=3,VLOOKUP(E68,Pivots!$AX$3:$BA$45,4))/2","v":121},-20.25,{"$f":"VLOOKUP(A68,Players!$A$2:$B$92,2,FALSE)","v":"Patrick Phair"},{"$f":"VLOOKUP(B68,Players!A$2:$B$92,2,FALSE)","v":"Jim Simons"}]
["TG","RHA",2,29,6,{"$f":"IF(C69=1,VLOOKUP(E69,Pivots!$AX$3:$BA$45,2))/2+IF(C69=2,VLOOKUP(E69,Pivots!$AX$3:$BA$45,3))/2+IF(C69=3,VLOOKUP(E69,Pivots!$AX$3:$BA$45,4))/2","v":121},-1.25,{"$f":"VLOOKUP(A69,Players!$A$2:$B$92,2,FALSE)","v":"Tricia Gilham"},{"$f":"VLOOKUP(B69,Players!A$2:$B$92,2,FALSE)","v":"Richard Harris"}]
["APR","DA",3,14,6,{"$f":"IF(C70=1,VLOOKUP(E70,Pivots!$AX$3:$BA$45,2))/2+IF(C70=2,VLOOKUP(E70,Pivots!$AX$3:$BA$45,3))/2+IF(C70=3,VLOOKUP(E70,Pivots!$AX$3:$BA$45,4))/2","v":131},-18.75,{"$f":"VLOOKUP(A70,Players!$A$2:$B$92,2,FALSE)","v":"Alison Pritchard"},{"$f":"VLOOKUP(B70,Players!A$2:$B$92,2,FALSE)","v":"David Atthey"}]
["RS","TL",3,41,6,{"$f":"IF(C71=1,VLOOKUP(E71,Pivots!$AX$3:$BA$45,2))/2+IF(C71=2,VLOOKUP(E71,Pivots!$AX$3:$BA$45,3))/2+IF(C71=3,VLOOKUP(E71,Pivots!$AX$3:$BA$45,4))/2","v":131},8.25,{"$f":"VLOOKUP(A71,Players!$A$2:$B$92,2,FALSE)","v":"Roger Schofield"},{"$f":"VLOOKUP(B71,Players!A$2:$B$92,2,FALSE)","v":"Tony Letts"}]
["PW","RJ",3,32,6,{"$f":"IF(C72=1,VLOOKUP(E72,Pivots!$AX$3:$BA$45,2))/2+IF(C72=2,VLOOKUP(E72,Pivots!$AX$3:$BA$45,3))/2+IF(C72=3,VLOOKUP(E72,Pivots!$AX$3:$BA$45,4))/2","v":131},-0.75,{"$f":"VLOOKUP(A72,Players!$A$2:$B$92,2,FALSE)","v":"Peter Waggett"},{"$f":"VLOOKUP(B72,Players!A$2:$B$92,2,FALSE)","v":"Roger Jackson"}]
["JC","MR",3,44,6,{"$f":"IF(C73=1,VLOOKUP(E73,Pivots!$AX$3:$BA$45,2))/2+IF(C73=2,VLOOKUP(E73,Pivots!$AX$3:$BA$45,3))/2+IF(C73=3,VLOOKUP(E73,Pivots!$AX$3:$BA$45,4))/2","v":131},11.25,{"$f":"VLOOKUP(A73,Players!$A$2:$B$92,2,FALSE)","v":"John Councer"},{"$f":"VLOOKUP(B73,Players!A$2:$B$92,2,FALSE)","v":"Mark Rogers"}]
["PSH","RCM",1,59,7,{"$f":"IF(C74=1,VLOOKUP(E74,Pivots!$AX$3:$BA$45,2))/2+IF(C74=2,VLOOKUP(E74,Pivots!$AX$3:$BA$45,3))/2+IF(C74=3,VLOOKUP(E74,Pivots!$AX$3:$BA$45,4))/2","v":71},41.25,{"$f":"VLOOKUP(A74,Players!$A$2:$B$92,2,FALSE)","v":"Patrick Shields"},{"$f":"VLOOKUP(B74,Players!A$2:$B$92,2,FALSE)","v":"Richard Chamberlain"}]
["JAT","CRO",1,20,7,{"$f":"IF(C75=1,VLOOKUP(E75,Pivots!$AX$3:$BA$45,2))/2+IF(C75=2,VLOOKUP(E75,Pivots!$AX$3:$BA$45,3))/2+IF(C75=3,VLOOKUP(E75,Pivots!$AX$3:$BA$45,4))/2","v":71},2.25,{"$f":"VLOOKUP(A75,Players!$A$2:$B$92,2,FALSE)","v":"John Atthey"},{"$f":"VLOOKUP(B75,Players!A$2:$B$92,2,FALSE)","v":"Claire Robinson"}]
["PD","RPL",1,11,7,{"$f":"IF(C76=1,VLOOKUP(E76,Pivots!$AX$3:$BA$45,2))/2+IF(C76=2,VLOOKUP(E76,Pivots!$AX$3:$BA$45,3))/2+IF(C76=3,VLOOKUP(E76,Pivots!$AX$3:$BA$45,4))/2","v":71},-6.75,{"$f":"VLOOKUP(A76,Players!$A$2:$B$92,2,FALSE)","v":"Paul Denning"},{"$f":"VLOOKUP(B76,Players!A$2:$B$92,2,FALSE)","v":"Richard Plackett"}]
["RB","KST",1,-19,7,{"$f":"IF(C77=1,VLOOKUP(E77,Pivots!$AX$3:$BA$45,2))/2+IF(C77=2,VLOOKUP(E77,Pivots!$AX$3:$BA$45,3))/2+IF(C77=3,VLOOKUP(E77,Pivots!$AX$3:$BA$45,4))/2","v":71},-36.75,{"$f":"VLOOKUP(A77,Players!$A$2:$B$92,2,FALSE)","v":"Richard Butland"},{"$f":"VLOOKUP(B77,Players!A$2:$B$92,2,FALSE)","v":"Keith Stanley"}]
["JC","MR",2,4,7,{"$f":"IF(C78=1,VLOOKUP(E78,Pivots!$AX$3:$BA$45,2))/2+IF(C78=2,VLOOKUP(E78,Pivots!$AX$3:$BA$45,3))/2+IF(C78=3,VLOOKUP(E78,Pivots!$AX$3:$BA$45,4))/2","v":-32},12,{"$f":"VLOOKUP(A78,Players!$A$2:$B$92,2,FALSE)","v":"John Councer"},{"$f":"VLOOKUP(B78,Players!A$2:$B$92,2,FALSE)","v":"Mark Rogers"}]
["MB","JAR",2,0,7,{"$f":"IF(C79=1,VLOOKUP(E79,Pivots!$AX$3:$BA$45,2))/2+IF(C79=2,VLOOKUP(E79,Pivots!$AX$3:$BA$45,3))/2+IF(C79=3,VLOOKUP(E79,Pivots!$AX$3:$BA$45,4))/2","v":-32},8,{"$f":"VLOOKUP(A79,Players!$A$2:$B$92,2,FALSE)","v":"Mel Barlow"},{"$f":"VLOOKUP(B79,Players!A$2:$B$92,2,FALSE)","v":"John Arblaster"}]
["DN","BY",2,-2,7,{"$f":"IF(C80=1,VLOOKUP(E80,Pivots!$AX$3:$BA$45,2))/2+IF(C80=2,VLOOKUP(E80,Pivots!$AX$3:$BA$45,3))/2+IF(C80=3,VLOOKUP(E80,Pivots!$AX$3:$BA$45,4))/2","v":-32},6,{"$f":"VLOOKUP(A80,Players!$A$2:$B$92,2,FALSE)","v":"Diana Nettleton"},{"$f":"VLOOKUP(B80,Players!A$2:$B$92,2,FALSE)","v":"Bryony Youngs"}]
["PPH","JSI",2,-34,7,{"$f":"IF(C81=1,VLOOKUP(E81,Pivots!$AX$3:$BA$45,2))/2+IF(C81=2,VLOOKUP(E81,Pivots!$AX$3:$BA$45,3))/2+IF(C81=3,VLOOKUP(E81,Pivots!$AX$3:$BA$45,4))/2","v":-32},-26,{"$f":"VLOOKUP(A81,Players!$A$2:$B$92,2,FALSE)","v":"Patrick Phair"},{"$f":"VLOOKUP(B81,Players!A$2:$B$92,2,FALSE)","v":"Jim Simons"}]
["APR","DA",3,17,7,{"$f":"IF(C82=1,VLOOKUP(E82,Pivots!$AX$3:$BA$45,2))/2+IF(C82=2,VLOOKUP(E82,Pivots!$AX$3:$BA$45,3))/2+IF(C82=3,VLOOKUP(E82,Pivots!$AX$3:$BA$45,4))/2","v":-35},25.75,{"$f":"VLOOKUP(A82,Players!$A$2:$B$92,2,FALSE)","v":"Alison Pritchard"},{"$f":"VLOOKUP(B82,Players!A$2:$B$92,2,FALSE)","v":"David Atthey"}]
["IC","VC",3,-6,7,{"$f":"IF(C83=1,VLOOKUP(E83,Pivots!$AX$3:$BA$45,2))/2+IF(C83=2,VLOOKUP(E83,Pivots!$AX$3:$BA$45,3))/2+IF(C83=3,VLOOKUP(E83,Pivots!$AX$3:$BA$45,4))/2","v":-35},2.75,{"$f":"VLOOKUP(A83,Players!$A$2:$B$92,2,FALSE)","v":"Ian Constable"},{"$f":"VLOOKUP(B83,Players!A$2:$B$92,2,FALSE)","v":"Val Constable"}]
["AKA","LH",3,-38,7,{"$f":"IF(C84=1,VLOOKUP(E84,Pivots!$AX$3:$BA$45,2))/2+IF(C84=2,VLOOKUP(E84,Pivots!$AX$3:$BA$45,3))/2+IF(C84=3,VLOOKUP(E84,Pivots!$AX$3:$BA$45,4))/2","v":-35},-29.25,{"$f":"VLOOKUP(A84,Players!$A$2:$B$92,2,FALSE)","v":"Ashok Kwatra"},{"$f":"VLOOKUP(B84,Players!A$2:$B$92,2,FALSE)","v":"Lesley Harrison"}]
["PW","RJ",3,-8,7,{"$f":"IF(C85=1,VLOOKUP(E85,Pivots!$AX$3:$BA$45,2))/2+IF(C85=2,VLOOKUP(E85,Pivots!$AX$3:$BA$45,3))/2+IF(C85=3,VLOOKUP(E85,Pivots!$AX$3:$BA$45,4))/2","v":-35},0.75,{"$f":"VLOOKUP(A85,Players!$A$2:$B$92,2,FALSE)","v":"Peter Waggett"},{"$f":"VLOOKUP(B85,Players!A$2:$B$92,2,FALSE)","v":"Roger Jackson"}]
["RB","GW",1,-11,11,{"$f":"IF(C86=1,VLOOKUP(E86,Pivots!$AX$3:$BA$45,2))/2+IF(C86=2,VLOOKUP(E86,Pivots!$AX$3:$BA$45,3))/2+IF(C86=3,VLOOKUP(E86,Pivots!$AX$3:$BA$45,4))/2","v":-1},-10.75,{"$f":"VLOOKUP(A86,Players!$A$2:$B$92,2,FALSE)","v":"Richard Butland"},{"$f":"VLOOKUP(B86,Players!A$2:$B$92,2,FALSE)","v":"Gary Watson"}]
["PSH","RCM",1,12,{"$f":"E86","v":11},{"$f":"IF(C87=1,VLOOKUP(E87,Pivots!$AX$3:$BA$45,2))/2+IF(C87=2,VLOOKUP(E87,Pivots!$AX$3:$BA$45,3))/2+IF(C87=3,VLOOKUP(E87,Pivots!$AX$3:$BA$45,4))/2","v":-1},12.25,{"$f":"VLOOKUP(A87,Players!$A$2:$B$92,2,FALSE)","v":"Patrick Shields"},{"$f":"VLOOKUP(B87,Players!A$2:$B$92,2,FALSE)","v":"Richard Chamberlain"}]
["PD","RPL",1,5,{"$f":"E87","v":11},{"$f":"IF(C88=1,VLOOKUP(E88,Pivots!$AX$3:$BA$45,2))/2+IF(C88=2,VLOOKUP(E88,Pivots!$AX$3:$BA$45,3))/2+IF(C88=3,VLOOKUP(E88,Pivots!$AX$3:$BA$45,4))/2","v":-1},5.25,{"$f":"VLOOKUP(A88,Players!$A$2:$B$92,2,FALSE)","v":"Paul Denning"},{"$f":"VLOOKUP(B88,Players!A$2:$B$92,2,FALSE)","v":"Richard Plackett"}]
["JC","MR",1,-7,11,{"$f":"IF(C89=1,VLOOKUP(E89,Pivots!$AX$3:$BA$45,2))/2+IF(C89=2,VLOOKUP(E89,Pivots!$AX$3:$BA$45,3))/2+IF(C89=3,VLOOKUP(E89,Pivots!$AX$3:$BA$45,4))/2","v":-1},-6.75,{"$f":"VLOOKUP(A89,Players!$A$2:$B$92,2,FALSE)","v":"John Councer"},{"$f":"VLOOKUP(B89,Players!A$2:$B$92,2,FALSE)","v":"Mark Rogers"}]
["JSI","PPH",2,3,11,{"$f":"IF(C90=1,VLOOKUP(E90,Pivots!$AX$3:$BA$45,2))/2+IF(C90=2,VLOOKUP(E90,Pivots!$AX$3:$BA$45,3))/2+IF(C90=3,VLOOKUP(E90,Pivots!$AX$3:$BA$45,4))/2","v":6},1.5,{"$f":"VLOOKUP(A90,Players!$A$2:$B$92,2,FALSE)","v":"Jim Simons"},{"$f":"VLOOKUP(B90,Players!A$2:$B$92,2,FALSE)","v":"Patrick Phair"}]
["RCO","PPE",2,13,11,{"$f":"IF(C91=1,VLOOKUP(E91,Pivots!$AX$3:$BA$45,2))/2+IF(C91=2,VLOOKUP(E91,Pivots!$AX$3:$BA$45,3))/2+IF(C91=3,VLOOKUP(E91,Pivots!$AX$3:$BA$45,4))/2","v":6},11.5,{"$f":"VLOOKUP(A91,Players!$A$2:$B$92,2,FALSE)","v":"Roy Collard"},{"$f":"VLOOKUP(B91,Players!A$2:$B$92,2,FALSE)","v":"Pam Pearce"}]
["TG","RHA",2,-4,11,{"$f":"IF(C92=1,VLOOKUP(E92,Pivots!$AX$3:$BA$45,2))/2+IF(C92=2,VLOOKUP(E92,Pivots!$AX$3:$BA$45,3))/2+IF(C92=3,VLOOKUP(E92,Pivots!$AX$3:$BA$45,4))/2","v":6},-5.5,{"$f":"VLOOKUP(A92,Players!$A$2:$B$92,2,FALSE)","v":"Tricia Gilham"},{"$f":"VLOOKUP(B92,Players!A$2:$B$92,2,FALSE)","v":"Richard Harris"}]
["PW","MW",2,-6,11,{"$f":"IF(C93=1,VLOOKUP(E93,Pivots!$AX$3:$BA$45,2))/2+IF(C93=2,VLOOKUP(E93,Pivots!$AX$3:$BA$45,3))/2+IF(C93=3,VLOOKUP(E93,Pivots!$AX$3:$BA$45,4))/2","v":6},-7.5,{"$f":"VLOOKUP(A93,Players!$A$2:$B$92,2,FALSE)","v":"Peter Waggett"},{"$f":"VLOOKUP(B93,Players!A$2:$B$92,2,FALSE)","v":"Mike Wignall"}]
["RS","TL",3,63,11,{"$f":"IF(C94=1,VLOOKUP(E94,Pivots!$AX$3:$BA$45,2))/2+IF(C94=2,VLOOKUP(E94,Pivots!$AX$3:$BA$45,3))/2+IF(C94=3,VLOOKUP(E94,Pivots!$AX$3:$BA$45,4))/2","v":108},36,{"$f":"VLOOKUP(A94,Players!$A$2:$B$92,2,FALSE)","v":"Roger Schofield"},{"$f":"VLOOKUP(B94,Players!A$2:$B$92,2,FALSE)","v":"Tony Letts"}]
["JUS","AS",3,5,11,{"$f":"IF(C95=1,VLOOKUP(E95,Pivots!$AX$3:$BA$45,2))/2+IF(C95=2,VLOOKUP(E95,Pivots!$AX$3:$BA$45,3))/2+IF(C95=3,VLOOKUP(E95,Pivots!$AX$3:$BA$45,4))/2","v":108},-22,{"$f":"VLOOKUP(A95,Players!$A$2:$B$92,2,FALSE)","v":"Judy Sanis"},{"$f":"VLOOKUP(B95,Players!A$2:$B$92,2,FALSE)","v":"Allan Sanis"}]
["LH","AKA",3,5,11,{"$f":"IF(C96=1,VLOOKUP(E96,Pivots!$AX$3:$BA$45,2))/2+IF(C96=2,VLOOKUP(E96,Pivots!$AX$3:$BA$45,3))/2+IF(C96=3,VLOOKUP(E96,Pivots!$AX$3:$BA$45,4))/2","v":108},-22,{"$f":"VLOOKUP(A96,Players!$A$2:$B$92,2,FALSE)","v":"Lesley Harrison"},{"$f":"VLOOKUP(B96,Players!A$2:$B$92,2,FALSE)","v":"Ashok Kwatra"}]
["PL","PSW",3,35,11,{"$f":"IF(C97=1,VLOOKUP(E97,Pivots!$AX$3:$BA$45,2))/2+IF(C97=2,VLOOKUP(E97,Pivots!$AX$3:$BA$45,3))/2+IF(C97=3,VLOOKUP(E97,Pivots!$AX$3:$BA$45,4))/2","v":108},8,{"$f":"VLOOKUP(A97,Players!$A$2:$B$92,2,FALSE)","v":"Paul Lilley"},{"$f":"VLOOKUP(B97,Players!A$2:$B$92,2,FALSE)","v":"Peter Swales"}]
["RPL","PD",1,44.6,{"$f":"E86+1","v":12},{"$f":"IF(C98=1,VLOOKUP(E98,Pivots!$AX$3:$BA$45,2))/2+IF(C98=2,VLOOKUP(E98,Pivots!$AX$3:$BA$45,3))/2+IF(C98=3,VLOOKUP(E98,Pivots!$AX$3:$BA$45,4))/2","v":99.86999999999999},19.632500000000004,{"$f":"VLOOKUP(A98,Players!$A$2:$B$92,2,FALSE)","v":"Richard Plackett"},{"$f":"VLOOKUP(B98,Players!A$2:$B$92,2,FALSE)","v":"Paul Denning"}]
["GW","RB",1,9.5399999999999991,{"$f":"E98","v":12},{"$f":"IF(C99=1,VLOOKUP(E99,Pivots!$AX$3:$BA$45,2))/2+IF(C99=2,VLOOKUP(E99,Pivots!$AX$3:$BA$45,3))/2+IF(C99=3,VLOOKUP(E99,Pivots!$AX$3:$BA$45,4))/2","v":99.86999999999999},-15.427499999999998,{"$f":"VLOOKUP(A99,Players!$A$2:$B$92,2,FALSE)","v":"Gary Watson"},{"$f":"VLOOKUP(B99,Players!A$2:$B$92,2,FALSE)","v":"Richard Butland"}]
["RCM","PSH",1,28.66,{"$f":"E99","v":12},{"$f":"IF(C100=1,VLOOKUP(E100,Pivots!$AX$3:$BA$45,2))/2+IF(C100=2,VLOOKUP(E100,Pivots!$AX$3:$BA$45,3))/2+IF(C100=3,VLOOKUP(E100,Pivots!$AX$3:$BA$45,4))/2","v":99.86999999999999},3.6925000000000026,{"$f":"VLOOKUP(A100,Players!$A$2:$B$92,2,FALSE)","v":"Richard Chamberlain"},{"$f":"VLOOKUP(B100,Players!A$2:$B$92,2,FALSE)","v":"Patrick Shields"}]
["JAT","CRO",1,17.07,12,{"$f":"IF(C101=1,VLOOKUP(E101,Pivots!$AX$3:$BA$45,2))/2+IF(C101=2,VLOOKUP(E101,Pivots!$AX$3:$BA$45,3))/2+IF(C101=3,VLOOKUP(E101,Pivots!$AX$3:$BA$45,4))/2","v":99.86999999999999},-7.8974999999999973,{"$f":"VLOOKUP(A101,Players!$A$2:$B$92,2,FALSE)","v":"John Atthey"},{"$f":"VLOOKUP(B101,Players!A$2:$B$92,2,FALSE)","v":"Claire Robinson"}]
["JAN","KST",2,29.45,12,{"$f":"IF(C102=1,VLOOKUP(E102,Pivots!$AX$3:$BA$45,2))/2+IF(C102=2,VLOOKUP(E102,Pivots!$AX$3:$BA$45,3))/2+IF(C102=3,VLOOKUP(E102,Pivots!$AX$3:$BA$45,4))/2","v":8.9100000000000019},27.2225,{"$f":"VLOOKUP(A102,Players!$A$2:$B$92,2,FALSE)","v":"Joe Angseesing"},{"$f":"VLOOKUP(B102,Players!A$2:$B$92,2,FALSE)","v":"Keith Stanley"}]
["JC","MR",2,6.53,12,{"$f":"IF(C103=1,VLOOKUP(E103,Pivots!$AX$3:$BA$45,2))/2+IF(C103=2,VLOOKUP(E103,Pivots!$AX$3:$BA$45,3))/2+IF(C103=3,VLOOKUP(E103,Pivots!$AX$3:$BA$45,4))/2","v":8.9100000000000019},4.3025000000000002,{"$f":"VLOOKUP(A103,Players!$A$2:$B$92,2,FALSE)","v":"John Councer"},{"$f":"VLOOKUP(B103,Players!A$2:$B$92,2,FALSE)","v":"Mark Rogers"}]
["PPH","JSI",2,-9.26,12,{"$f":"IF(C104=1,VLOOKUP(E104,Pivots!$AX$3:$BA$45,2))/2+IF(C104=2,VLOOKUP(E104,Pivots!$AX$3:$BA$45,3))/2+IF(C104=3,VLOOKUP(E104,Pivots!$AX$3:$BA$45,4))/2","v":8.9100000000000019},-11.487500000000001,{"$f":"VLOOKUP(A104,Players!$A$2:$B$92,2,FALSE)","v":"Patrick Phair"},{"$f":"VLOOKUP(B104,Players!A$2:$B$92,2,FALSE)","v":"Jim Simons"}]
["WA","MW",2,-17.809999999999999,12,{"$f":"IF(C105=1,VLOOKUP(E105,Pivots!$AX$3:$BA$45,2))/2+IF(C105=2,VLOOKUP(E105,Pivots!$AX$3:$BA$45,3))/2+IF(C105=3,VLOOKUP(E105,Pivots!$AX$3:$BA$45,4))/2","v":8.9100000000000019},-20.037499999999998,{"$f":"VLOOKUP(A105,Players!$A$2:$B$92,2,FALSE)","v":"Wendy Angseesing"},{"$f":"VLOOKUP(B105,Players!A$2:$B$92,2,FALSE)","v":"Mike Wignall"}]
["RS","TL",3,-29.16,12,{"$f":"IF(C106=1,VLOOKUP(E106,Pivots!$AX$3:$BA$45,2))/2+IF(C106=2,VLOOKUP(E106,Pivots!$AX$3:$BA$45,3))/2+IF(C106=3,VLOOKUP(E106,Pivots!$AX$3:$BA$45,4))/2","v":-35.250000000000007},-20.347499999999997,{"$f":"VLOOKUP(A106,Players!$A$2:$B$92,2,FALSE)","v":"Roger Schofield"},{"$f":"VLOOKUP(B106,Players!A$2:$B$92,2,FALSE)","v":"Tony Letts"}]
["TG","RHA",3,-0.26,12,{"$f":"IF(C107=1,VLOOKUP(E107,Pivots!$AX$3:$BA$45,2))/2+IF(C107=2,VLOOKUP(E107,Pivots!$AX$3:$BA$45,3))/2+IF(C107=3,VLOOKUP(E107,Pivots!$AX$3:$BA$45,4))/2","v":-35.250000000000007},8.552500000000002,{"$f":"VLOOKUP(A107,Players!$A$2:$B$92,2,FALSE)","v":"Tricia Gilham"},{"$f":"VLOOKUP(B107,Players!A$2:$B$92,2,FALSE)","v":"Richard Harris"}]
["KAS","RW",3,-7.38,12,{"$f":"IF(C108=1,VLOOKUP(E108,Pivots!$AX$3:$BA$45,2))/2+IF(C108=2,VLOOKUP(E108,Pivots!$AX$3:$BA$45,3))/2+IF(C108=3,VLOOKUP(E108,Pivots!$AX$3:$BA$45,4))/2","v":-35.250000000000007},1.4325000000000019,{"$f":"VLOOKUP(A108,Players!$A$2:$B$92,2,FALSE)","v":"Anne Swannell"},{"$f":"VLOOKUP(B108,Players!A$2:$B$92,2,FALSE)","v":"Roger Williams"}]
["PW","RJ",3,1.55,12,{"$f":"IF(C109=1,VLOOKUP(E109,Pivots!$AX$3:$BA$45,2))/2+IF(C109=2,VLOOKUP(E109,Pivots!$AX$3:$BA$45,3))/2+IF(C109=3,VLOOKUP(E109,Pivots!$AX$3:$BA$45,4))/2","v":-35.250000000000007},10.362500000000002,{"$f":"VLOOKUP(A109,Players!$A$2:$B$92,2,FALSE)","v":"Peter Waggett"},{"$f":"VLOOKUP(B109,Players!A$2:$B$92,2,FALSE)","v":"Roger Jackson"}]
["PD","RPL",1,43,{"$f":"E98+1","v":13},{"$f":"IF(C110=1,VLOOKUP(E110,Pivots!$AX$3:$BA$45,2))/2+IF(C110=2,VLOOKUP(E110,Pivots!$AX$3:$BA$45,3))/2+IF(C110=3,VLOOKUP(E110,Pivots!$AX$3:$BA$45,4))/2","v":69},25.75,{"$f":"VLOOKUP(A110,Players!$A$2:$B$92,2,FALSE)","v":"Paul Denning"},{"$f":"VLOOKUP(B110,Players!A$2:$B$92,2,FALSE)","v":"Richard Plackett"}]
["PSH","RCM",1,28,{"$f":"E110","v":13},{"$f":"IF(C111=1,VLOOKUP(E111,Pivots!$AX$3:$BA$45,2))/2+IF(C111=2,VLOOKUP(E111,Pivots!$AX$3:$BA$45,3))/2+IF(C111=3,VLOOKUP(E111,Pivots!$AX$3:$BA$45,4))/2","v":69},10.75,{"$f":"VLOOKUP(A111,Players!$A$2:$B$92,2,FALSE)","v":"Patrick Shields"},{"$f":"VLOOKUP(B111,Players!A$2:$B$92,2,FALSE)","v":"Richard Chamberlain"}]
["GW","RB",1,26,{"$f":"E111","v":13},{"$f":"IF(C112=1,VLOOKUP(E112,Pivots!$AX$3:$BA$45,2))/2+IF(C112=2,VLOOKUP(E112,Pivots!$AX$3:$BA$45,3))/2+IF(C112=3,VLOOKUP(E112,Pivots!$AX$3:$BA$45,4))/2","v":69},8.75,{"$f":"VLOOKUP(A112,Players!$A$2:$B$92,2,FALSE)","v":"Gary Watson"},{"$f":"VLOOKUP(B112,Players!A$2:$B$92,2,FALSE)","v":"Richard Butland"}]
["JAN","KST",1,-28,13,{"$f":"IF(C113=1,VLOOKUP(E113,Pivots!$AX$3:$BA$45,2))/2+IF(C113=2,VLOOKUP(E113,Pivots!$AX$3:$BA$45,3))/2+IF(C113=3,VLOOKUP(E113,Pivots!$AX$3:$BA$45,4))/2","v":69},-45.25,{"$f":"VLOOKUP(A113,Players!$A$2:$B$92,2,FALSE)","v":"Joe Angseesing"},{"$f":"VLOOKUP(B113,Players!A$2:$B$92,2,FALSE)","v":"Keith Stanley"}]
["TG","RHA",2,42,13,{"$f":"IF(C114=1,VLOOKUP(E114,Pivots!$AX$3:$BA$45,2))/2+IF(C114=2,VLOOKUP(E114,Pivots!$AX$3:$BA$45,3))/2+IF(C114=3,VLOOKUP(E114,Pivots!$AX$3:$BA$45,4))/2","v":99},17.25,{"$f":"VLOOKUP(A114,Players!$A$2:$B$92,2,FALSE)","v":"Tricia Gilham"},{"$f":"VLOOKUP(B114,Players!A$2:$B$92,2,FALSE)","v":"Richard Harris"}]
["MB","JAR",2,30,13,{"$f":"IF(C115=1,VLOOKUP(E115,Pivots!$AX$3:$BA$45,2))/2+IF(C115=2,VLOOKUP(E115,Pivots!$AX$3:$BA$45,3))/2+IF(C115=3,VLOOKUP(E115,Pivots!$AX$3:$BA$45,4))/2","v":99},5.25,{"$f":"VLOOKUP(A115,Players!$A$2:$B$92,2,FALSE)","v":"Mel Barlow"},{"$f":"VLOOKUP(B115,Players!A$2:$B$92,2,FALSE)","v":"John Arblaster"}]
["MR","JC",2,21,13,{"$f":"IF(C116=1,VLOOKUP(E116,Pivots!$AX$3:$BA$45,2))/2+IF(C116=2,VLOOKUP(E116,Pivots!$AX$3:$BA$45,3))/2+IF(C116=3,VLOOKUP(E116,Pivots!$AX$3:$BA$45,4))/2","v":99},-3.75,{"$f":"VLOOKUP(A116,Players!$A$2:$B$92,2,FALSE)","v":"Mark Rogers"},{"$f":"VLOOKUP(B116,Players!A$2:$B$92,2,FALSE)","v":"John Councer"}]
["WA","MW",2,6,13,{"$f":"IF(C117=1,VLOOKUP(E117,Pivots!$AX$3:$BA$45,2))/2+IF(C117=2,VLOOKUP(E117,Pivots!$AX$3:$BA$45,3))/2+IF(C117=3,VLOOKUP(E117,Pivots!$AX$3:$BA$45,4))/2","v":99},-18.75,{"$f":"VLOOKUP(A117,Players!$A$2:$B$92,2,FALSE)","v":"Wendy Angseesing"},{"$f":"VLOOKUP(B117,Players!A$2:$B$92,2,FALSE)","v":"Mike Wignall"}]
["Pl","PSW",3,50,13,{"$f":"IF(C118=1,VLOOKUP(E118,Pivots!$AX$3:$BA$45,2))/2+IF(C118=2,VLOOKUP(E118,Pivots!$AX$3:$BA$45,3))/2+IF(C118=3,VLOOKUP(E118,Pivots!$AX$3:$BA$45,4))/2","v":131},17.25,{"$f":"VLOOKUP(A118,Players!$A$2:$B$92,2,FALSE)","v":"Paul Lilley"},{"$f":"VLOOKUP(B118,Players!A$2:$B$92,2,FALSE)","v":"Peter Swales"}]
["PW","RJ",3,32,13,{"$f":"IF(C119=1,VLOOKUP(E119,Pivots!$AX$3:$BA$45,2))/2+IF(C119=2,VLOOKUP(E119,Pivots!$AX$3:$BA$45,3))/2+IF(C119=3,VLOOKUP(E119,Pivots!$AX$3:$BA$45,4))/2","v":131},-0.75,{"$f":"VLOOKUP(A119,Players!$A$2:$B$92,2,FALSE)","v":"Peter Waggett"},{"$f":"VLOOKUP(B119,Players!A$2:$B$92,2,FALSE)","v":"Roger Jackson"}]
["KAS","RW",3,22,13,{"$f":"IF(C120=1,VLOOKUP(E120,Pivots!$AX$3:$BA$45,2))/2+IF(C120=2,VLOOKUP(E120,Pivots!$AX$3:$BA$45,3))/2+IF(C120=3,VLOOKUP(E120,Pivots!$AX$3:$BA$45,4))/2","v":131},-10.75,{"$f":"VLOOKUP(A120,Players!$A$2:$B$92,2,FALSE)","v":"Anne Swannell"},{"$f":"VLOOKUP(B120,Players!A$2:$B$92,2,FALSE)","v":"Roger Williams"}]
["TL","RS",3,27,13,{"$f":"IF(C121=1,VLOOKUP(E121,Pivots!$AX$3:$BA$45,2))/2+IF(C121=2,VLOOKUP(E121,Pivots!$AX$3:$BA$45,3))/2+IF(C121=3,VLOOKUP(E121,Pivots!$AX$3:$BA$45,4))/2","v":131},-5.75,{"$f":"VLOOKUP(A121,Players!$A$2:$B$92,2,FALSE)","v":"Tony Letts"},{"$f":"VLOOKUP(B121,Players!A$2:$B$92,2,FALSE)","v":"Roger Schofield"}]
["PD","RPL",1,49,{"$f":"E110+1","v":14},{"$f":"IF(C122=1,VLOOKUP(E122,Pivots!$AX$3:$BA$45,2))/2+IF(C122=2,VLOOKUP(E122,Pivots!$AX$3:$BA$45,3))/2+IF(C122=3,VLOOKUP(E122,Pivots!$AX$3:$BA$45,4))/2","v":121},18.75,{"$f":"VLOOKUP(A122,Players!$A$2:$B$92,2,FALSE)","v":"Paul Denning"},{"$f":"VLOOKUP(B122,Players!A$2:$B$92,2,FALSE)","v":"Richard Plackett"}]
["PSH","RCM",1,29,{"$f":"E122","v":14},{"$f":"IF(C123=1,VLOOKUP(E123,Pivots!$AX$3:$BA$45,2))/2+IF(C123=2,VLOOKUP(E123,Pivots!$AX$3:$BA$45,3))/2+IF(C123=3,VLOOKUP(E123,Pivots!$AX$3:$BA$45,4))/2","v":121},-1.25,{"$f":"VLOOKUP(A123,Players!$A$2:$B$92,2,FALSE)","v":"Patrick Shields"},{"$f":"VLOOKUP(B123,Players!A$2:$B$92,2,FALSE)","v":"Richard Chamberlain"}]
["JAN","KST",1,23,{"$f":"E123","v":14},{"$f":"IF(C124=1,VLOOKUP(E124,Pivots!$AX$3:$BA$45,2))/2+IF(C124=2,VLOOKUP(E124,Pivots!$AX$3:$BA$45,3))/2+IF(C124=3,VLOOKUP(E124,Pivots!$AX$3:$BA$45,4))/2","v":121},-7.25,{"$f":"VLOOKUP(A124,Players!$A$2:$B$92,2,FALSE)","v":"Joe Angseesing"},{"$f":"VLOOKUP(B124,Players!A$2:$B$92,2,FALSE)","v":"Keith Stanley"}]
["RB","GW",1,20,14,{"$f":"IF(C125=1,VLOOKUP(E125,Pivots!$AX$3:$BA$45,2))/2+IF(C125=2,VLOOKUP(E125,Pivots!$AX$3:$BA$45,3))/2+IF(C125=3,VLOOKUP(E125,Pivots!$AX$3:$BA$45,4))/2","v":121},-10.25,{"$f":"VLOOKUP(A125,Players!$A$2:$B$92,2,FALSE)","v":"Richard Butland"},{"$f":"VLOOKUP(B125,Players!A$2:$B$92,2,FALSE)","v":"Gary Watson"}]
["PPH","JSI",2,23,14,{"$f":"IF(C126=1,VLOOKUP(E126,Pivots!$AX$3:$BA$45,2))/2+IF(C126=2,VLOOKUP(E126,Pivots!$AX$3:$BA$45,3))/2+IF(C126=3,VLOOKUP(E126,Pivots!$AX$3:$BA$45,4))/2","v":30},15.5,{"$f":"VLOOKUP(A126,Players!$A$2:$B$92,2,FALSE)","v":"Patrick Phair"},{"$f":"VLOOKUP(B126,Players!A$2:$B$92,2,FALSE)","v":"Jim Simons"}]
["RCO","PPE",2,9,14,{"$f":"IF(C127=1,VLOOKUP(E127,Pivots!$AX$3:$BA$45,2))/2+IF(C127=2,VLOOKUP(E127,Pivots!$AX$3:$BA$45,3))/2+IF(C127=3,VLOOKUP(E127,Pivots!$AX$3:$BA$45,4))/2","v":30},1.5,{"$f":"VLOOKUP(A127,Players!$A$2:$B$92,2,FALSE)","v":"Roy Collard"},{"$f":"VLOOKUP(B127,Players!A$2:$B$92,2,FALSE)","v":"Pam Pearce"}]
["MR","JC",2,1,14,{"$f":"IF(C128=1,VLOOKUP(E128,Pivots!$AX$3:$BA$45,2))/2+IF(C128=2,VLOOKUP(E128,Pivots!$AX$3:$BA$45,3))/2+IF(C128=3,VLOOKUP(E128,Pivots!$AX$3:$BA$45,4))/2","v":30},-6.5,{"$f":"VLOOKUP(A128,Players!$A$2:$B$92,2,FALSE)","v":"Mark Rogers"},{"$f":"VLOOKUP(B128,Players!A$2:$B$92,2,FALSE)","v":"John Councer"}]
["WA","MW",2,-3,14,{"$f":"IF(C129=1,VLOOKUP(E129,Pivots!$AX$3:$BA$45,2))/2+IF(C129=2,VLOOKUP(E129,Pivots!$AX$3:$BA$45,3))/2+IF(C129=3,VLOOKUP(E129,Pivots!$AX$3:$BA$45,4))/2","v":30},-10.5,{"$f":"VLOOKUP(A129,Players!$A$2:$B$92,2,FALSE)","v":"Wendy Angseesing"},{"$f":"VLOOKUP(B129,Players!A$2:$B$92,2,FALSE)","v":"Mike Wignall"}]
["PL","PSW",3,37,14,{"$f":"IF(C130=1,VLOOKUP(E130,Pivots!$AX$3:$BA$45,2))/2+IF(C130=2,VLOOKUP(E130,Pivots!$AX$3:$BA$45,3))/2+IF(C130=3,VLOOKUP(E130,Pivots!$AX$3:$BA$45,4))/2","v":93},{"$f":"IF(A130=\"\",\"\",D130-F130/4)","v":13.75},{"$f":"VLOOKUP(A130,Players!$A$2:$B$92,2,FALSE)","v":"Paul Lilley"},{"$f":"VLOOKUP(B130,Players!A$2:$B$92,2,FALSE)","v":"Peter Swales"}]
["PW","RJ",3,36,14,{"$f":"IF(C131=1,VLOOKUP(E131,Pivots!$AX$3:$BA$45,2))/2+IF(C131=2,VLOOKUP(E131,Pivots!$AX$3:$BA$45,3))/2+IF(C131=3,VLOOKUP(E131,Pivots!$AX$3:$BA$45,4))/2","v":93},12.75,{"$f":"VLOOKUP(A131,Players!$A$2:$B$92,2,FALSE)","v":"Peter Waggett"},{"$f":"VLOOKUP(B131,Players!A$2:$B$92,2,FALSE)","v":"Roger Jackson"}]
["AKA","LH",3,12,14,{"$f":"IF(C132=1,VLOOKUP(E132,Pivots!$AX$3:$BA$45,2))/2+IF(C132=2,VLOOKUP(E132,Pivots!$AX$3:$BA$45,3))/2+IF(C132=3,VLOOKUP(E132,Pivots!$AX$3:$BA$45,4))/2","v":93},-11.25,{"$f":"VLOOKUP(A132,Players!$A$2:$B$92,2,FALSE)","v":"Ashok Kwatra"},{"$f":"VLOOKUP(B132,Players!A$2:$B$92,2,FALSE)","v":"Lesley Harrison"}]
["APR","DA",3,8,14,{"$f":"IF(C133=1,VLOOKUP(E133,Pivots!$AX$3:$BA$45,2))/2+IF(C133=2,VLOOKUP(E133,Pivots!$AX$3:$BA$45,3))/2+IF(C133=3,VLOOKUP(E133,Pivots!$AX$3:$BA$45,4))/2","v":93},-15.25,{"$f":"VLOOKUP(A133,Players!$A$2:$B$92,2,FALSE)","v":"Alison Pritchard"},{"$f":"VLOOKUP(B133,Players!A$2:$B$92,2,FALSE)","v":"David Atthey"}]
["PSH","PD",1,49,{"$f":"E122+1","v":15},{"$f":"IF(C134=1,VLOOKUP(E134,Pivots!$AX$3:$BA$45,2))/2+IF(C134=2,VLOOKUP(E134,Pivots!$AX$3:$BA$45,3))/2+IF(C134=3,VLOOKUP(E134,Pivots!$AX$3:$BA$45,4))/2","v":57},34.75,{"$f":"VLOOKUP(A134,Players!$A$2:$B$92,2,FALSE)","v":"Patrick Shields"},{"$f":"VLOOKUP(B134,Players!A$2:$B$92,2,FALSE)","v":"Paul Denning"}]
["JAN","KST",1,16,{"$f":"E134","v":15},{"$f":"IF(C135=1,VLOOKUP(E135,Pivots!$AX$3:$BA$45,2))/2+IF(C135=2,VLOOKUP(E135,Pivots!$AX$3:$BA$45,3))/2+IF(C135=3,VLOOKUP(E135,Pivots!$AX$3:$BA$45,4))/2","v":57},1.75,{"$f":"VLOOKUP(A135,Players!$A$2:$B$92,2,FALSE)","v":"Joe Angseesing"},{"$f":"VLOOKUP(B135,Players!A$2:$B$92,2,FALSE)","v":"Keith Stanley"}]
["GW","RB",1,2,{"$f":"E135","v":15},{"$f":"IF(C136=1,VLOOKUP(E136,Pivots!$AX$3:$BA$45,2))/2+IF(C136=2,VLOOKUP(E136,Pivots!$AX$3:$BA$45,3))/2+IF(C136=3,VLOOKUP(E136,Pivots!$AX$3:$BA$45,4))/2","v":57},-12.25,{"$f":"VLOOKUP(A136,Players!$A$2:$B$92,2,FALSE)","v":"Gary Watson"},{"$f":"VLOOKUP(B136,Players!A$2:$B$92,2,FALSE)","v":"Richard Butland"}]
["JAT","CRO",1,-10,15,{"$f":"IF(C137=1,VLOOKUP(E137,Pivots!$AX$3:$BA$45,2))/2+IF(C137=2,VLOOKUP(E137,Pivots!$AX$3:$BA$45,3))/2+IF(C137=3,VLOOKUP(E137,Pivots!$AX$3:$BA$45,4))/2","v":57},-24.25,{"$f":"VLOOKUP(A137,Players!$A$2:$B$92,2,FALSE)","v":"John Atthey"},{"$f":"VLOOKUP(B137,Players!A$2:$B$92,2,FALSE)","v":"Claire Robinson"}]
["PSW","PL",2,46,15,{"$f":"IF(C138=1,VLOOKUP(E138,Pivots!$AX$3:$BA$45,2))/2+IF(C138=2,VLOOKUP(E138,Pivots!$AX$3:$BA$45,3))/2+IF(C138=3,VLOOKUP(E138,Pivots!$AX$3:$BA$45,4))/2","v":57},31.75,{"$f":"VLOOKUP(A138,Players!$A$2:$B$92,2,FALSE)","v":"Peter Swales"},{"$f":"VLOOKUP(B138,Players!A$2:$B$92,2,FALSE)","v":"Paul Lilley"}]
["MR","JC",2,4,15,{"$f":"IF(C139=1,VLOOKUP(E139,Pivots!$AX$3:$BA$45,2))/2+IF(C139=2,VLOOKUP(E139,Pivots!$AX$3:$BA$45,3))/2+IF(C139=3,VLOOKUP(E139,Pivots!$AX$3:$BA$45,4))/2","v":57},-10.25,{"$f":"VLOOKUP(A139,Players!$A$2:$B$92,2,FALSE)","v":"Mark Rogers"},{"$f":"VLOOKUP(B139,Players!A$2:$B$92,2,FALSE)","v":"John Councer"}]
["PPH","JSI",2,5,15,{"$f":"IF(C140=1,VLOOKUP(E140,Pivots!$AX$3:$BA$45,2))/2+IF(C140=2,VLOOKUP(E140,Pivots!$AX$3:$BA$45,3))/2+IF(C140=3,VLOOKUP(E140,Pivots!$AX$3:$BA$45,4))/2","v":57},-9.25,{"$f":"VLOOKUP(A140,Players!$A$2:$B$92,2,FALSE)","v":"Patrick Phair"},{"$f":"VLOOKUP(B140,Players!A$2:$B$92,2,FALSE)","v":"Jim Simons"}]
["RCO","PPe",2,2,15,{"$f":"IF(C141=1,VLOOKUP(E141,Pivots!$AX$3:$BA$45,2))/2+IF(C141=2,VLOOKUP(E141,Pivots!$AX$3:$BA$45,3))/2+IF(C141=3,VLOOKUP(E141,Pivots!$AX$3:$BA$45,4))/2","v":57},-12.25,{"$f":"VLOOKUP(A141,Players!$A$2:$B$92,2,FALSE)","v":"Roy Collard"},{"$f":"VLOOKUP(B141,Players!A$2:$B$92,2,FALSE)","v":"Pam Pearce"}]
["JUS","As",3,11,15,{"$f":"IF(C142=1,VLOOKUP(E142,Pivots!$AX$3:$BA$45,2))/2+IF(C142=2,VLOOKUP(E142,Pivots!$AX$3:$BA$45,3))/2+IF(C142=3,VLOOKUP(E142,Pivots!$AX$3:$BA$45,4))/2","v":11},8.25,{"$f":"VLOOKUP(A142,Players!$A$2:$B$92,2,FALSE)","v":"Judy Sanis"},{"$f":"VLOOKUP(B142,Players!A$2:$B$92,2,FALSE)","v":"Allan Sanis"}]
["PW","RJ",3,11,15,{"$f":"IF(C143=1,VLOOKUP(E143,Pivots!$AX$3:$BA$45,2))/2+IF(C143=2,VLOOKUP(E143,Pivots!$AX$3:$BA$45,3))/2+IF(C143=3,VLOOKUP(E143,Pivots!$AX$3:$BA$45,4))/2","v":11},8.25,{"$f":"VLOOKUP(A143,Players!$A$2:$B$92,2,FALSE)","v":"Peter Waggett"},{"$f":"VLOOKUP(B143,Players!A$2:$B$92,2,FALSE)","v":"Roger Jackson"}]
["RS","TL",3,4,15,{"$f":"IF(C144=1,VLOOKUP(E144,Pivots!$AX$3:$BA$45,2))/2+IF(C144=2,VLOOKUP(E144,Pivots!$AX$3:$BA$45,3))/2+IF(C144=3,VLOOKUP(E144,Pivots!$AX$3:$BA$45,4))/2","v":11},1.25,{"$f":"VLOOKUP(A144,Players!$A$2:$B$92,2,FALSE)","v":"Roger Schofield"},{"$f":"VLOOKUP(B144,Players!A$2:$B$92,2,FALSE)","v":"Tony Letts"}]
["DA","APR",3,-15,15,{"$f":"IF(C145=1,VLOOKUP(E145,Pivots!$AX$3:$BA$45,2))/2+IF(C145=2,VLOOKUP(E145,Pivots!$AX$3:$BA$45,3))/2+IF(C145=3,VLOOKUP(E145,Pivots!$AX$3:$BA$45,4))/2","v":11},-17.75,{"$f":"VLOOKUP(A145,Players!$A$2:$B$92,2,FALSE)","v":"David Atthey"},{"$f":"VLOOKUP(B145,Players!A$2:$B$92,2,FALSE)","v":"Alison Pritchard"}]
["PSH","RCM",1,21,{"$f":"E134+1","v":16},{"$f":"IF(C146=1,VLOOKUP(E146,Pivots!$AX$3:$BA$45,2))/2+IF(C146=2,VLOOKUP(E146,Pivots!$AX$3:$BA$45,3))/2+IF(C146=3,VLOOKUP(E146,Pivots!$AX$3:$BA$45,4))/2","v":12},18,{"$f":"VLOOKUP(A146,Players!$A$2:$B$92,2,FALSE)","v":"Patrick Shields"},{"$f":"VLOOKUP(B146,Players!A$2:$B$92,2,FALSE)","v":"Richard Chamberlain"}]
["JAT","CRO",1,16,{"$f":"E146","v":16},{"$f":"IF(C147=1,VLOOKUP(E147,Pivots!$AX$3:$BA$45,2))/2+IF(C147=2,VLOOKUP(E147,Pivots!$AX$3:$BA$45,3))/2+IF(C147=3,VLOOKUP(E147,Pivots!$AX$3:$BA$45,4))/2","v":12},13,{"$f":"VLOOKUP(A147,Players!$A$2:$B$92,2,FALSE)","v":"John Atthey"},{"$f":"VLOOKUP(B147,Players!A$2:$B$92,2,FALSE)","v":"Claire Robinson"}]
["PD","RPL",1,-8,{"$f":"E147","v":16},{"$f":"IF(C148=1,VLOOKUP(E148,Pivots!$AX$3:$BA$45,2))/2+IF(C148=2,VLOOKUP(E148,Pivots!$AX$3:$BA$45,3))/2+IF(C148=3,VLOOKUP(E148,Pivots!$AX$3:$BA$45,4))/2","v":12},-11,{"$f":"VLOOKUP(A148,Players!$A$2:$B$92,2,FALSE)","v":"Paul Denning"},{"$f":"VLOOKUP(B148,Players!A$2:$B$92,2,FALSE)","v":"Richard Plackett"}]
["GW","RB",1,-17,16,{"$f":"IF(C149=1,VLOOKUP(E149,Pivots!$AX$3:$BA$45,2))/2+IF(C149=2,VLOOKUP(E149,Pivots!$AX$3:$BA$45,3))/2+IF(C149=3,VLOOKUP(E149,Pivots!$AX$3:$BA$45,4))/2","v":12},-20,{"$f":"VLOOKUP(A149,Players!$A$2:$B$92,2,FALSE)","v":"Gary Watson"},{"$f":"VLOOKUP(B149,Players!A$2:$B$92,2,FALSE)","v":"Richard Butland"}]
["PPH","JSI",2,41,16,{"$f":"IF(C150=1,VLOOKUP(E150,Pivots!$AX$3:$BA$45,2))/2+IF(C150=2,VLOOKUP(E150,Pivots!$AX$3:$BA$45,3))/2+IF(C150=3,VLOOKUP(E150,Pivots!$AX$3:$BA$45,4))/2","v":3},40.25,{"$f":"VLOOKUP(A150,Players!$A$2:$B$92,2,FALSE)","v":"Patrick Phair"},{"$f":"VLOOKUP(B150,Players!A$2:$B$92,2,FALSE)","v":"Jim Simons"}]
["RCO","PPE",2,15,16,{"$f":"IF(C151=1,VLOOKUP(E151,Pivots!$AX$3:$BA$45,2))/2+IF(C151=2,VLOOKUP(E151,Pivots!$AX$3:$BA$45,3))/2+IF(C151=3,VLOOKUP(E151,Pivots!$AX$3:$BA$45,4))/2","v":3},14.25,{"$f":"VLOOKUP(A151,Players!$A$2:$B$92,2,FALSE)","v":"Roy Collard"},{"$f":"VLOOKUP(B151,Players!A$2:$B$92,2,FALSE)","v":"Pam Pearce"}]
["TH","AW",2,-27,16,{"$f":"IF(C152=1,VLOOKUP(E152,Pivots!$AX$3:$BA$45,2))/2+IF(C152=2,VLOOKUP(E152,Pivots!$AX$3:$BA$45,3))/2+IF(C152=3,VLOOKUP(E152,Pivots!$AX$3:$BA$45,4))/2","v":3},-27.75,{"$f":"VLOOKUP(A152,Players!$A$2:$B$92,2,FALSE)","v":"Tony Hill"},{"$f":"VLOOKUP(B152,Players!A$2:$B$92,2,FALSE)","v":"Alan Wearmouth"}]
["JAR","MB",2,-26,16,{"$f":"IF(C153=1,VLOOKUP(E153,Pivots!$AX$3:$BA$45,2))/2+IF(C153=2,VLOOKUP(E153,Pivots!$AX$3:$BA$45,3))/2+IF(C153=3,VLOOKUP(E153,Pivots!$AX$3:$BA$45,4))/2","v":3},-26.75,{"$f":"VLOOKUP(A153,Players!$A$2:$B$92,2,FALSE)","v":"John Arblaster"},{"$f":"VLOOKUP(B153,Players!A$2:$B$92,2,FALSE)","v":"Mel Barlow"}]
["RS","TL",3,42,16,{"$f":"IF(C154=1,VLOOKUP(E154,Pivots!$AX$3:$BA$45,2))/2+IF(C154=2,VLOOKUP(E154,Pivots!$AX$3:$BA$45,3))/2+IF(C154=3,VLOOKUP(E154,Pivots!$AX$3:$BA$45,4))/2","v":-33},50.25,{"$f":"VLOOKUP(A154,Players!$A$2:$B$92,2,FALSE)","v":"Roger Schofield"},{"$f":"VLOOKUP(B154,Players!A$2:$B$92,2,FALSE)","v":"Tony Letts"}]
["LH","AKA",3,-48,16,{"$f":"IF(C155=1,VLOOKUP(E155,Pivots!$AX$3:$BA$45,2))/2+IF(C155=2,VLOOKUP(E155,Pivots!$AX$3:$BA$45,3))/2+IF(C155=3,VLOOKUP(E155,Pivots!$AX$3:$BA$45,4))/2","v":-33},-39.75,{"$f":"VLOOKUP(A155,Players!$A$2:$B$92,2,FALSE)","v":"Lesley Harrison"},{"$f":"VLOOKUP(B155,Players!A$2:$B$92,2,FALSE)","v":"Ashok Kwatra"}]
["PW","RJ",3,-26,16,{"$f":"IF(C156=1,VLOOKUP(E156,Pivots!$AX$3:$BA$45,2))/2+IF(C156=2,VLOOKUP(E156,Pivots!$AX$3:$BA$45,3))/2+IF(C156=3,VLOOKUP(E156,Pivots!$AX$3:$BA$45,4))/2","v":-33},-17.75,{"$f":"VLOOKUP(A156,Players!$A$2:$B$92,2,FALSE)","v":"Peter Waggett"},{"$f":"VLOOKUP(B156,Players!A$2:$B$92,2,FALSE)","v":"Roger Jackson"}]
["TG","RHA",3,-1,16,{"$f":"IF(C157=1,VLOOKUP(E157,Pivots!$AX$3:$BA$45,2))/2+IF(C157=2,VLOOKUP(E157,Pivots!$AX$3:$BA$45,3))/2+IF(C157=3,VLOOKUP(E157,Pivots!$AX$3:$BA$45,4))/2","v":-33},7.25,{"$f":"VLOOKUP(A157,Players!$A$2:$B$92,2,FALSE)","v":"Tricia Gilham"},{"$f":"VLOOKUP(B157,Players!A$2:$B$92,2,FALSE)","v":"Richard Harris"}]
["RB","GW",1,31,21,{"$f":"IF(C158=1,VLOOKUP(E158,Pivots!$AX$3:$BA$45,2))/2+IF(C158=2,VLOOKUP(E158,Pivots!$AX$3:$BA$45,3))/2+IF(C158=3,VLOOKUP(E158,Pivots!$AX$3:$BA$45,4))/2","v":191},-16.75,{"$f":"VLOOKUP(A158,Players!$A$2:$B$92,2,FALSE)","v":"Richard Butland"},{"$f":"VLOOKUP(B158,Players!A$2:$B$92,2,FALSE)","v":"Gary Watson"}]
["JAT","CRO",1,104,{"$f":"E158","v":21},{"$f":"IF(C159=1,VLOOKUP(E159,Pivots!$AX$3:$BA$45,2))/2+IF(C159=2,VLOOKUP(E159,Pivots!$AX$3:$BA$45,3))/2+IF(C159=3,VLOOKUP(E159,Pivots!$AX$3:$BA$45,4))/2","v":191},56.25,{"$f":"VLOOKUP(A159,Players!$A$2:$B$92,2,FALSE)","v":"John Atthey"},{"$f":"VLOOKUP(B159,Players!A$2:$B$92,2,FALSE)","v":"Claire Robinson"}]
["JAN","RCM",1,32,{"$f":"E159","v":21},{"$f":"IF(C160=1,VLOOKUP(E160,Pivots!$AX$3:$BA$45,2))/2+IF(C160=2,VLOOKUP(E160,Pivots!$AX$3:$BA$45,3))/2+IF(C160=3,VLOOKUP(E160,Pivots!$AX$3:$BA$45,4))/2","v":191},-15.75,{"$f":"VLOOKUP(A160,Players!$A$2:$B$92,2,FALSE)","v":"Joe Angseesing"},{"$f":"VLOOKUP(B160,Players!A$2:$B$92,2,FALSE)","v":"Richard Chamberlain"}]
["PD","RPL",1,24,21,{"$f":"IF(C161=1,VLOOKUP(E161,Pivots!$AX$3:$BA$45,2))/2+IF(C161=2,VLOOKUP(E161,Pivots!$AX$3:$BA$45,3))/2+IF(C161=3,VLOOKUP(E161,Pivots!$AX$3:$BA$45,4))/2","v":191},-23.75,{"$f":"VLOOKUP(A161,Players!$A$2:$B$92,2,FALSE)","v":"Paul Denning"},{"$f":"VLOOKUP(B161,Players!A$2:$B$92,2,FALSE)","v":"Richard Plackett"}]
["RS","TL",2,14,21,{"$f":"IF(C162=1,VLOOKUP(E162,Pivots!$AX$3:$BA$45,2))/2+IF(C162=2,VLOOKUP(E162,Pivots!$AX$3:$BA$45,3))/2+IF(C162=3,VLOOKUP(E162,Pivots!$AX$3:$BA$45,4))/2","v":67},-2.75,{"$f":"VLOOKUP(A162,Players!$A$2:$B$92,2,FALSE)","v":"Roger Schofield"},{"$f":"VLOOKUP(B162,Players!A$2:$B$92,2,FALSE)","v":"Tony Letts"}]
["JC","MR",2,21,21,{"$f":"IF(C163=1,VLOOKUP(E163,Pivots!$AX$3:$BA$45,2))/2+IF(C163=2,VLOOKUP(E163,Pivots!$AX$3:$BA$45,3))/2+IF(C163=3,VLOOKUP(E163,Pivots!$AX$3:$BA$45,4))/2","v":67},4.25,{"$f":"VLOOKUP(A163,Players!$A$2:$B$92,2,FALSE)","v":"John Councer"},{"$f":"VLOOKUP(B163,Players!A$2:$B$92,2,FALSE)","v":"Mark Rogers"}]
["RCO","PPE",2,27,21,{"$f":"IF(C164=1,VLOOKUP(E164,Pivots!$AX$3:$BA$45,2))/2+IF(C164=2,VLOOKUP(E164,Pivots!$AX$3:$BA$45,3))/2+IF(C164=3,VLOOKUP(E164,Pivots!$AX$3:$BA$45,4))/2","v":67},10.25,{"$f":"VLOOKUP(A164,Players!$A$2:$B$92,2,FALSE)","v":"Roy Collard"},{"$f":"VLOOKUP(B164,Players!A$2:$B$92,2,FALSE)","v":"Pam Pearce"}]
["PSW","PL",2,5,21,{"$f":"IF(C165=1,VLOOKUP(E165,Pivots!$AX$3:$BA$45,2))/2+IF(C165=2,VLOOKUP(E165,Pivots!$AX$3:$BA$45,3))/2+IF(C165=3,VLOOKUP(E165,Pivots!$AX$3:$BA$45,4))/2","v":67},-11.75,{"$f":"VLOOKUP(A165,Players!$A$2:$B$92,2,FALSE)","v":"Peter Swales"},{"$f":"VLOOKUP(B165,Players!A$2:$B$92,2,FALSE)","v":"Paul Lilley"}]
["RJ","PW",3,50,21,{"$f":"IF(C166=1,VLOOKUP(E166,Pivots!$AX$3:$BA$45,2))/2+IF(C166=2,VLOOKUP(E166,Pivots!$AX$3:$BA$45,3))/2+IF(C166=3,VLOOKUP(E166,Pivots!$AX$3:$BA$45,4))/2","v":64},34,{"$f":"VLOOKUP(A166,Players!$A$2:$B$92,2,FALSE)","v":"Roger Jackson"},{"$f":"VLOOKUP(B166,Players!A$2:$B$92,2,FALSE)","v":"Peter Waggett"}]
["MB","JAR",3,23,21,{"$f":"IF(C167=1,VLOOKUP(E167,Pivots!$AX$3:$BA$45,2))/2+IF(C167=2,VLOOKUP(E167,Pivots!$AX$3:$BA$45,3))/2+IF(C167=3,VLOOKUP(E167,Pivots!$AX$3:$BA$45,4))/2","v":64},7,{"$f":"VLOOKUP(A167,Players!$A$2:$B$92,2,FALSE)","v":"Mel Barlow"},{"$f":"VLOOKUP(B167,Players!A$2:$B$92,2,FALSE)","v":"John Arblaster"}]
["WA","MW",3,16,21,{"$f":"IF(C168=1,VLOOKUP(E168,Pivots!$AX$3:$BA$45,2))/2+IF(C168=2,VLOOKUP(E168,Pivots!$AX$3:$BA$45,3))/2+IF(C168=3,VLOOKUP(E168,Pivots!$AX$3:$BA$45,4))/2","v":64},0,{"$f":"VLOOKUP(A168,Players!$A$2:$B$92,2,FALSE)","v":"Wendy Angseesing"},{"$f":"VLOOKUP(B168,Players!A$2:$B$92,2,FALSE)","v":"Mike Wignall"}]
["JSI","VC",3,-25,21,{"$f":"IF(C169=1,VLOOKUP(E169,Pivots!$AX$3:$BA$45,2))/2+IF(C169=2,VLOOKUP(E169,Pivots!$AX$3:$BA$45,3))/2+IF(C169=3,VLOOKUP(E169,Pivots!$AX$3:$BA$45,4))/2","v":64},-41,{"$f":"VLOOKUP(A169,Players!$A$2:$B$92,2,FALSE)","v":"Jim Simons"},{"$f":"VLOOKUP(B169,Players!A$2:$B$92,2,FALSE)","v":"Val Constable"}]
["PSH","RCM",1,25,22,{"$f":"IF(C170=1,VLOOKUP(E170,Pivots!$AX$3:$BA$45,2))/2+IF(C170=2,VLOOKUP(E170,Pivots!$AX$3:$BA$45,3))/2+IF(C170=3,VLOOKUP(E170,Pivots!$AX$3:$BA$45,4))/2","v":1},24.75,{"$f":"VLOOKUP(A170,Players!$A$2:$B$92,2,FALSE)","v":"Patrick Shields"},{"$f":"VLOOKUP(B170,Players!A$2:$B$92,2,FALSE)","v":"Richard Chamberlain"}]
["RB","KST",1,22,{"$f":"E170","v":22},{"$f":"IF(C171=1,VLOOKUP(E171,Pivots!$AX$3:$BA$45,2))/2+IF(C171=2,VLOOKUP(E171,Pivots!$AX$3:$BA$45,3))/2+IF(C171=3,VLOOKUP(E171,Pivots!$AX$3:$BA$45,4))/2","v":1},21.75,{"$f":"VLOOKUP(A171,Players!$A$2:$B$92,2,FALSE)","v":"Richard Butland"},{"$f":"VLOOKUP(B171,Players!A$2:$B$92,2,FALSE)","v":"Keith Stanley"}]
["JAN","WA",1,-39,{"$f":"E171","v":22},{"$f":"IF(C172=1,VLOOKUP(E172,Pivots!$AX$3:$BA$45,2))/2+IF(C172=2,VLOOKUP(E172,Pivots!$AX$3:$BA$45,3))/2+IF(C172=3,VLOOKUP(E172,Pivots!$AX$3:$BA$45,4))/2","v":1},-39.25,{"$f":"VLOOKUP(A172,Players!$A$2:$B$92,2,FALSE)","v":"Joe Angseesing"},{"$f":"VLOOKUP(B172,Players!A$2:$B$92,2,FALSE)","v":"Wendy Angseesing"}]
["PD","RPL",1,-7,22,{"$f":"IF(C173=1,VLOOKUP(E173,Pivots!$AX$3:$BA$45,2))/2+IF(C173=2,VLOOKUP(E173,Pivots!$AX$3:$BA$45,3))/2+IF(C173=3,VLOOKUP(E173,Pivots!$AX$3:$BA$45,4))/2","v":1},-7.25,{"$f":"VLOOKUP(A173,Players!$A$2:$B$92,2,FALSE)","v":"Paul Denning"},{"$f":"VLOOKUP(B173,Players!A$2:$B$92,2,FALSE)","v":"Richard Plackett"}]
["RS","TL",2,28,22,{"$f":"IF(C174=1,VLOOKUP(E174,Pivots!$AX$3:$BA$45,2))/2+IF(C174=2,VLOOKUP(E174,Pivots!$AX$3:$BA$45,3))/2+IF(C174=3,VLOOKUP(E174,Pivots!$AX$3:$BA$45,4))/2","v":88},6,{"$f":"VLOOKUP(A174,Players!$A$2:$B$92,2,FALSE)","v":"Roger Schofield"},{"$f":"VLOOKUP(B174,Players!A$2:$B$92,2,FALSE)","v":"Tony Letts"}]
["RCO","PPE",2,14,22,{"$f":"IF(C175=1,VLOOKUP(E175,Pivots!$AX$3:$BA$45,2))/2+IF(C175=2,VLOOKUP(E175,Pivots!$AX$3:$BA$45,3))/2+IF(C175=3,VLOOKUP(E175,Pivots!$AX$3:$BA$45,4))/2","v":88},-8,{"$f":"VLOOKUP(A175,Players!$A$2:$B$92,2,FALSE)","v":"Roy Collard"},{"$f":"VLOOKUP(B175,Players!A$2:$B$92,2,FALSE)","v":"Pam Pearce"}]
["MB","JAR",2,-10,22,{"$f":"IF(C176=1,VLOOKUP(E176,Pivots!$AX$3:$BA$45,2))/2+IF(C176=2,VLOOKUP(E176,Pivots!$AX$3:$BA$45,3))/2+IF(C176=3,VLOOKUP(E176,Pivots!$AX$3:$BA$45,4))/2","v":88},-32,{"$f":"VLOOKUP(A176,Players!$A$2:$B$92,2,FALSE)","v":"Mel Barlow"},{"$f":"VLOOKUP(B176,Players!A$2:$B$92,2,FALSE)","v":"John Arblaster"}]
["PPH","MW",2,56,22,{"$f":"IF(C177=1,VLOOKUP(E177,Pivots!$AX$3:$BA$45,2))/2+IF(C177=2,VLOOKUP(E177,Pivots!$AX$3:$BA$45,3))/2+IF(C177=3,VLOOKUP(E177,Pivots!$AX$3:$BA$45,4))/2","v":88},34,{"$f":"VLOOKUP(A177,Players!$A$2:$B$92,2,FALSE)","v":"Patrick Phair"},{"$f":"VLOOKUP(B177,Players!A$2:$B$92,2,FALSE)","v":"Mike Wignall"}]
["JSI","VC",3,41,22,{"$f":"IF(C178=1,VLOOKUP(E178,Pivots!$AX$3:$BA$45,2))/2+IF(C178=2,VLOOKUP(E178,Pivots!$AX$3:$BA$45,3))/2+IF(C178=3,VLOOKUP(E178,Pivots!$AX$3:$BA$45,4))/2","v":98},16.5,{"$f":"VLOOKUP(A178,Players!$A$2:$B$92,2,FALSE)","v":"Jim Simons"},{"$f":"VLOOKUP(B178,Players!A$2:$B$92,2,FALSE)","v":"Val Constable"}]
["AS","JSI",3,-12,22,{"$f":"IF(C179=1,VLOOKUP(E179,Pivots!$AX$3:$BA$45,2))/2+IF(C179=2,VLOOKUP(E179,Pivots!$AX$3:$BA$45,3))/2+IF(C179=3,VLOOKUP(E179,Pivots!$AX$3:$BA$45,4))/2","v":98},-36.5,{"$f":"VLOOKUP(A179,Players!$A$2:$B$92,2,FALSE)","v":"Allan Sanis"},{"$f":"VLOOKUP(B179,Players!A$2:$B$92,2,FALSE)","v":"Jim Simons"}]
["RHA","BR",3,51,22,{"$f":"IF(C180=1,VLOOKUP(E180,Pivots!$AX$3:$BA$45,2))/2+IF(C180=2,VLOOKUP(E180,Pivots!$AX$3:$BA$45,3))/2+IF(C180=3,VLOOKUP(E180,Pivots!$AX$3:$BA$45,4))/2","v":98},26.5,{"$f":"VLOOKUP(A180,Players!$A$2:$B$92,2,FALSE)","v":"Richard Harris"},{"$f":"VLOOKUP(B180,Players!A$2:$B$92,2,FALSE)","v":"Ben Ritacca"}]
["PW","RJ",3,18,22,{"$f":"IF(C181=1,VLOOKUP(E181,Pivots!$AX$3:$BA$45,2))/2+IF(C181=2,VLOOKUP(E181,Pivots!$AX$3:$BA$45,3))/2+IF(C181=3,VLOOKUP(E181,Pivots!$AX$3:$BA$45,4))/2","v":98},-6.5,{"$f":"VLOOKUP(A181,Players!$A$2:$B$92,2,FALSE)","v":"Peter Waggett"},{"$f":"VLOOKUP(B181,Players!A$2:$B$92,2,FALSE)","v":"Roger Jackson"}]
["KST","JAN",1,37,{"$f":"E170+1","v":23},{"$f":"IF(C182=1,VLOOKUP(E182,Pivots!$AX$3:$BA$45,2))/2+IF(C182=2,VLOOKUP(E182,Pivots!$AX$3:$BA$45,3))/2+IF(C182=3,VLOOKUP(E182,Pivots!$AX$3:$BA$45,4))/2","v":46},25.5,{"$f":"VLOOKUP(A182,Players!$A$2:$B$92,2,FALSE)","v":"Keith Stanley"},{"$f":"VLOOKUP(B182,Players!A$2:$B$92,2,FALSE)","v":"Joe Angseesing"}]
["RB","AKM",1,-10,{"$f":"E182","v":23},{"$f":"IF(C183=1,VLOOKUP(E183,Pivots!$AX$3:$BA$45,2))/2+IF(C183=2,VLOOKUP(E183,Pivots!$AX$3:$BA$45,3))/2+IF(C183=3,VLOOKUP(E183,Pivots!$AX$3:$BA$45,4))/2","v":46},-21.5,{"$f":"VLOOKUP(A183,Players!$A$2:$B$92,2,FALSE)","v":"Richard Butland"},{"$f":"VLOOKUP(B183,Players!A$2:$B$92,2,FALSE)","v":"Andrew Kambites"}]
["AW","TH",1,2,{"$f":"E183","v":23},{"$f":"IF(C184=1,VLOOKUP(E184,Pivots!$AX$3:$BA$45,2))/2+IF(C184=2,VLOOKUP(E184,Pivots!$AX$3:$BA$45,3))/2+IF(C184=3,VLOOKUP(E184,Pivots!$AX$3:$BA$45,4))/2","v":46},-9.5,{"$f":"VLOOKUP(A184,Players!$A$2:$B$92,2,FALSE)","v":"Alan Wearmouth"},{"$f":"VLOOKUP(B184,Players!A$2:$B$92,2,FALSE)","v":"Tony Hill"}]
["PD","RPL",1,17,23,{"$f":"IF(C185=1,VLOOKUP(E185,Pivots!$AX$3:$BA$45,2))/2+IF(C185=2,VLOOKUP(E185,Pivots!$AX$3:$BA$45,3))/2+IF(C185=3,VLOOKUP(E185,Pivots!$AX$3:$BA$45,4))/2","v":46},5.5,{"$f":"VLOOKUP(A185,Players!$A$2:$B$92,2,FALSE)","v":"Paul Denning"},{"$f":"VLOOKUP(B185,Players!A$2:$B$92,2,FALSE)","v":"Richard Plackett"}]
["MR","JC",2,10,23,{"$f":"IF(C186=1,VLOOKUP(E186,Pivots!$AX$3:$BA$45,2))/2+IF(C186=2,VLOOKUP(E186,Pivots!$AX$3:$BA$45,3))/2+IF(C186=3,VLOOKUP(E186,Pivots!$AX$3:$BA$45,4))/2","v":-65},26.25,{"$f":"VLOOKUP(A186,Players!$A$2:$B$92,2,FALSE)","v":"Mark Rogers"},{"$f":"VLOOKUP(B186,Players!A$2:$B$92,2,FALSE)","v":"John Councer"}]
["VC","JSI",2,-13,23,{"$f":"IF(C187=1,VLOOKUP(E187,Pivots!$AX$3:$BA$45,2))/2+IF(C187=2,VLOOKUP(E187,Pivots!$AX$3:$BA$45,3))/2+IF(C187=3,VLOOKUP(E187,Pivots!$AX$3:$BA$45,4))/2","v":-65},3.25,{"$f":"VLOOKUP(A187,Players!$A$2:$B$92,2,FALSE)","v":"Val Constable"},{"$f":"VLOOKUP(B187,Players!A$2:$B$92,2,FALSE)","v":"Jim Simons"}]
["RS","TL",2,-26,23,{"$f":"IF(C188=1,VLOOKUP(E188,Pivots!$AX$3:$BA$45,2))/2+IF(C188=2,VLOOKUP(E188,Pivots!$AX$3:$BA$45,3))/2+IF(C188=3,VLOOKUP(E188,Pivots!$AX$3:$BA$45,4))/2","v":-65},-9.75,{"$f":"VLOOKUP(A188,Players!$A$2:$B$92,2,FALSE)","v":"Roger Schofield"},{"$f":"VLOOKUP(B188,Players!A$2:$B$92,2,FALSE)","v":"Tony Letts"}]
["PSW","PL",2,-36,23,{"$f":"IF(C189=1,VLOOKUP(E189,Pivots!$AX$3:$BA$45,2))/2+IF(C189=2,VLOOKUP(E189,Pivots!$AX$3:$BA$45,3))/2+IF(C189=3,VLOOKUP(E189,Pivots!$AX$3:$BA$45,4))/2","v":-65},-19.75,{"$f":"VLOOKUP(A189,Players!$A$2:$B$92,2,FALSE)","v":"Peter Swales"},{"$f":"VLOOKUP(B189,Players!A$2:$B$92,2,FALSE)","v":"Paul Lilley"}]
["DA","APR",3,31,23,{"$f":"IF(C190=1,VLOOKUP(E190,Pivots!$AX$3:$BA$45,2))/2+IF(C190=2,VLOOKUP(E190,Pivots!$AX$3:$BA$45,3))/2+IF(C190=3,VLOOKUP(E190,Pivots!$AX$3:$BA$45,4))/2","v":88},9,{"$f":"VLOOKUP(A190,Players!$A$2:$B$92,2,FALSE)","v":"David Atthey"},{"$f":"VLOOKUP(B190,Players!A$2:$B$92,2,FALSE)","v":"Alison Pritchard"}]
["BR","RHA",3,27,23,{"$f":"IF(C191=1,VLOOKUP(E191,Pivots!$AX$3:$BA$45,2))/2+IF(C191=2,VLOOKUP(E191,Pivots!$AX$3:$BA$45,3))/2+IF(C191=3,VLOOKUP(E191,Pivots!$AX$3:$BA$45,4))/2","v":88},5,{"$f":"VLOOKUP(A191,Players!$A$2:$B$92,2,FALSE)","v":"Ben Ritacca"},{"$f":"VLOOKUP(B191,Players!A$2:$B$92,2,FALSE)","v":"Richard Harris"}]
["MW","pph",3,25,23,{"$f":"IF(C192=1,VLOOKUP(E192,Pivots!$AX$3:$BA$45,2))/2+IF(C192=2,VLOOKUP(E192,Pivots!$AX$3:$BA$45,3))/2+IF(C192=3,VLOOKUP(E192,Pivots!$AX$3:$BA$45,4))/2","v":88},3,{"$f":"VLOOKUP(A192,Players!$A$2:$B$92,2,FALSE)","v":"Mike Wignall"},{"$f":"VLOOKUP(B192,Players!A$2:$B$92,2,FALSE)","v":"Patrick Phair"}]
["PW","RJ",3,5,23,{"$f":"IF(C193=1,VLOOKUP(E193,Pivots!$AX$3:$BA$45,2))/2+IF(C193=2,VLOOKUP(E193,Pivots!$AX$3:$BA$45,3))/2+IF(C193=3,VLOOKUP(E193,Pivots!$AX$3:$BA$45,4))/2","v":88},-17,{"$f":"VLOOKUP(A193,Players!$A$2:$B$92,2,FALSE)","v":"Peter Waggett"},{"$f":"VLOOKUP(B193,Players!A$2:$B$92,2,FALSE)","v":"Roger Jackson"}]
["PSH","RCM",1,11,{"$f":"E182+1","v":24},{"$f":"IF(C194=1,VLOOKUP(E194,Pivots!$AX$3:$BA$45,2))/2+IF(C194=2,VLOOKUP(E194,Pivots!$AX$3:$BA$45,3))/2+IF(C194=3,VLOOKUP(E194,Pivots!$AX$3:$BA$45,4))/2","v":-3},{"$f":"IF(A194=\"\",\"\",D194-F194/4)","v":11.75},{"$f":"VLOOKUP(A194,Players!$A$2:$B$92,2,FALSE)","v":"Patrick Shields"},{"$f":"VLOOKUP(B194,Players!A$2:$B$92,2,FALSE)","v":"Richard Chamberlain"}]
["PD","RPL",1,-1,{"$f":"E194","v":24},{"$f":"IF(C195=1,VLOOKUP(E195,Pivots!$AX$3:$BA$45,2))/2+IF(C195=2,VLOOKUP(E195,Pivots!$AX$3:$BA$45,3))/2+IF(C195=3,VLOOKUP(E195,Pivots!$AX$3:$BA$45,4))/2","v":-3},-0.25,{"$f":"VLOOKUP(A195,Players!$A$2:$B$92,2,FALSE)","v":"Paul Denning"},{"$f":"VLOOKUP(B195,Players!A$2:$B$92,2,FALSE)","v":"Richard Plackett"}]
["RB","GW",1,26,{"$f":"E195","v":24},{"$f":"IF(C196=1,VLOOKUP(E196,Pivots!$AX$3:$BA$45,2))/2+IF(C196=2,VLOOKUP(E196,Pivots!$AX$3:$BA$45,3))/2+IF(C196=3,VLOOKUP(E196,Pivots!$AX$3:$BA$45,4))/2","v":-3},26.75,{"$f":"VLOOKUP(A196,Players!$A$2:$B$92,2,FALSE)","v":"Richard Butland"},{"$f":"VLOOKUP(B196,Players!A$2:$B$92,2,FALSE)","v":"Gary Watson"}]
["AW","TH",1,-39,24,{"$f":"IF(C197=1,VLOOKUP(E197,Pivots!$AX$3:$BA$45,2))/2+IF(C197=2,VLOOKUP(E197,Pivots!$AX$3:$BA$45,3))/2+IF(C197=3,VLOOKUP(E197,Pivots!$AX$3:$BA$45,4))/2","v":-3},-38.25,{"$f":"VLOOKUP(A197,Players!$A$2:$B$92,2,FALSE)","v":"Alan Wearmouth"},{"$f":"VLOOKUP(B197,Players!A$2:$B$92,2,FALSE)","v":"Tony Hill"}]
["VC","JSi",2,-16,24,{"$f":"IF(C198=1,VLOOKUP(E198,Pivots!$AX$3:$BA$45,2))/2+IF(C198=2,VLOOKUP(E198,Pivots!$AX$3:$BA$45,3))/2+IF(C198=3,VLOOKUP(E198,Pivots!$AX$3:$BA$45,4))/2","v":-32},-8,{"$f":"VLOOKUP(A198,Players!$A$2:$B$92,2,FALSE)","v":"Val Constable"},{"$f":"VLOOKUP(B198,Players!A$2:$B$92,2,FALSE)","v":"Jim Simons"}]
["PSW","Pl",2,46,24,{"$f":"IF(C199=1,VLOOKUP(E199,Pivots!$AX$3:$BA$45,2))/2+IF(C199=2,VLOOKUP(E199,Pivots!$AX$3:$BA$45,3))/2+IF(C199=3,VLOOKUP(E199,Pivots!$AX$3:$BA$45,4))/2","v":-32},54,{"$f":"VLOOKUP(A199,Players!$A$2:$B$92,2,FALSE)","v":"Peter Swales"},{"$f":"VLOOKUP(B199,Players!A$2:$B$92,2,FALSE)","v":"Paul Lilley"}]
["RCO","MR",2,-67,24,{"$f":"IF(C200=1,VLOOKUP(E200,Pivots!$AX$3:$BA$45,2))/2+IF(C200=2,VLOOKUP(E200,Pivots!$AX$3:$BA$45,3))/2+IF(C200=3,VLOOKUP(E200,Pivots!$AX$3:$BA$45,4))/2","v":-32},-59,{"$f":"VLOOKUP(A200,Players!$A$2:$B$92,2,FALSE)","v":"Roy Collard"},{"$f":"VLOOKUP(B200,Players!A$2:$B$92,2,FALSE)","v":"Mark Rogers"}]
["PPH","MW",2,5,24,{"$f":"IF(C201=1,VLOOKUP(E201,Pivots!$AX$3:$BA$45,2))/2+IF(C201=2,VLOOKUP(E201,Pivots!$AX$3:$BA$45,3))/2+IF(C201=3,VLOOKUP(E201,Pivots!$AX$3:$BA$45,4))/2","v":-32},13,{"$f":"VLOOKUP(A201,Players!$A$2:$B$92,2,FALSE)","v":"Patrick Phair"},{"$f":"VLOOKUP(B201,Players!A$2:$B$92,2,FALSE)","v":"Mike Wignall"}]
["PW","RJ",3,33,24,{"$f":"IF(C202=1,VLOOKUP(E202,Pivots!$AX$3:$BA$45,2))/2+IF(C202=2,VLOOKUP(E202,Pivots!$AX$3:$BA$45,3))/2+IF(C202=3,VLOOKUP(E202,Pivots!$AX$3:$BA$45,4))/2","v":-18},37.5,{"$f":"VLOOKUP(A202,Players!$A$2:$B$92,2,FALSE)","v":"Peter Waggett"},{"$f":"VLOOKUP(B202,Players!A$2:$B$92,2,FALSE)","v":"Roger Jackson"}]
["RHA","BR",3,68,24,{"$f":"IF(C203=1,VLOOKUP(E203,Pivots!$AX$3:$BA$45,2))/2+IF(C203=2,VLOOKUP(E203,Pivots!$AX$3:$BA$45,3))/2+IF(C203=3,VLOOKUP(E203,Pivots!$AX$3:$BA$45,4))/2","v":-18},72.5,{"$f":"VLOOKUP(A203,Players!$A$2:$B$92,2,FALSE)","v":"Richard Harris"},{"$f":"VLOOKUP(B203,Players!A$2:$B$92,2,FALSE)","v":"Ben Ritacca"}]
["ML","Rw",3,-31,24,{"$f":"IF(C204=1,VLOOKUP(E204,Pivots!$AX$3:$BA$45,2))/2+IF(C204=2,VLOOKUP(E204,Pivots!$AX$3:$BA$45,3))/2+IF(C204=3,VLOOKUP(E204,Pivots!$AX$3:$BA$45,4))/2","v":-18},-26.5,{"$f":"VLOOKUP(A204,Players!$A$2:$B$92,2,FALSE)","v":"Mike Lewis"},{"$f":"VLOOKUP(B204,Players!A$2:$B$92,2,FALSE)","v":"Roger Williams"}]
["JUS","AS",3,-88,24,{"$f":"IF(C205=1,VLOOKUP(E205,Pivots!$AX$3:$BA$45,2))/2+IF(C205=2,VLOOKUP(E205,Pivots!$AX$3:$BA$45,3))/2+IF(C205=3,VLOOKUP(E205,Pivots!$AX$3:$BA$45,4))/2","v":-18},-83.5,{"$f":"VLOOKUP(A205,Players!$A$2:$B$92,2,FALSE)","v":"Judy Sanis"},{"$f":"VLOOKUP(B205,Players!A$2:$B$92,2,FALSE)","v":"Allan Sanis"}]
["psh","RCM",1,48,{"$f":"E194+1","v":25},{"$f":"IF(C206=1,VLOOKUP(E206,Pivots!$AX$3:$BA$45,2))/2+IF(C206=2,VLOOKUP(E206,Pivots!$AX$3:$BA$45,3))/2+IF(C206=3,VLOOKUP(E206,Pivots!$AX$3:$BA$45,4))/2","v":90},25.5,{"$f":"VLOOKUP(A206,Players!$A$2:$B$92,2,FALSE)","v":"Patrick Shields"},{"$f":"VLOOKUP(B206,Players!A$2:$B$92,2,FALSE)","v":"Richard Chamberlain"}]
["JAN","KST",1,33,{"$f":"E206","v":25},{"$f":"IF(C207=1,VLOOKUP(E207,Pivots!$AX$3:$BA$45,2))/2+IF(C207=2,VLOOKUP(E207,Pivots!$AX$3:$BA$45,3))/2+IF(C207=3,VLOOKUP(E207,Pivots!$AX$3:$BA$45,4))/2","v":90},10.5,{"$f":"VLOOKUP(A207,Players!$A$2:$B$92,2,FALSE)","v":"Joe Angseesing"},{"$f":"VLOOKUP(B207,Players!A$2:$B$92,2,FALSE)","v":"Keith Stanley"}]
["PD","RPL",1,25,{"$f":"E207","v":25},{"$f":"IF(C208=1,VLOOKUP(E208,Pivots!$AX$3:$BA$45,2))/2+IF(C208=2,VLOOKUP(E208,Pivots!$AX$3:$BA$45,3))/2+IF(C208=3,VLOOKUP(E208,Pivots!$AX$3:$BA$45,4))/2","v":90},2.5,{"$f":"VLOOKUP(A208,Players!$A$2:$B$92,2,FALSE)","v":"Paul Denning"},{"$f":"VLOOKUP(B208,Players!A$2:$B$92,2,FALSE)","v":"Richard Plackett"}]
["GW","AS",1,-16,25,{"$f":"IF(C209=1,VLOOKUP(E209,Pivots!$AX$3:$BA$45,2))/2+IF(C209=2,VLOOKUP(E209,Pivots!$AX$3:$BA$45,3))/2+IF(C209=3,VLOOKUP(E209,Pivots!$AX$3:$BA$45,4))/2","v":90},-38.5,{"$f":"VLOOKUP(A209,Players!$A$2:$B$92,2,FALSE)","v":"Gary Watson"},{"$f":"VLOOKUP(B209,Players!A$2:$B$92,2,FALSE)","v":"Allan Sanis"}]
["BR","RHA",2,8,25,{"$f":"IF(C210=1,VLOOKUP(E210,Pivots!$AX$3:$BA$45,2))/2+IF(C210=2,VLOOKUP(E210,Pivots!$AX$3:$BA$45,3))/2+IF(C210=3,VLOOKUP(E210,Pivots!$AX$3:$BA$45,4))/2","v":-2},8.5,{"$f":"VLOOKUP(A210,Players!$A$2:$B$92,2,FALSE)","v":"Ben Ritacca"},{"$f":"VLOOKUP(B210,Players!A$2:$B$92,2,FALSE)","v":"Richard Harris"}]
["PSW","PL",2,8,25,{"$f":"IF(C211=1,VLOOKUP(E211,Pivots!$AX$3:$BA$45,2))/2+IF(C211=2,VLOOKUP(E211,Pivots!$AX$3:$BA$45,3))/2+IF(C211=3,VLOOKUP(E211,Pivots!$AX$3:$BA$45,4))/2","v":-2},8.5,{"$f":"VLOOKUP(A211,Players!$A$2:$B$92,2,FALSE)","v":"Peter Swales"},{"$f":"VLOOKUP(B211,Players!A$2:$B$92,2,FALSE)","v":"Paul Lilley"}]
["RS","TL",2,24,25,{"$f":"IF(C212=1,VLOOKUP(E212,Pivots!$AX$3:$BA$45,2))/2+IF(C212=2,VLOOKUP(E212,Pivots!$AX$3:$BA$45,3))/2+IF(C212=3,VLOOKUP(E212,Pivots!$AX$3:$BA$45,4))/2","v":-2},24.5,{"$f":"VLOOKUP(A212,Players!$A$2:$B$92,2,FALSE)","v":"Roger Schofield"},{"$f":"VLOOKUP(B212,Players!A$2:$B$92,2,FALSE)","v":"Tony Letts"}]
["MR","JC",2,-42,25,{"$f":"IF(C213=1,VLOOKUP(E213,Pivots!$AX$3:$BA$45,2))/2+IF(C213=2,VLOOKUP(E213,Pivots!$AX$3:$BA$45,3))/2+IF(C213=3,VLOOKUP(E213,Pivots!$AX$3:$BA$45,4))/2","v":-2},-41.5,{"$f":"VLOOKUP(A213,Players!$A$2:$B$92,2,FALSE)","v":"Mark Rogers"},{"$f":"VLOOKUP(B213,Players!A$2:$B$92,2,FALSE)","v":"John Councer"}]
["APR","DA",3,32,25,{"$f":"IF(C214=1,VLOOKUP(E214,Pivots!$AX$3:$BA$45,2))/2+IF(C214=2,VLOOKUP(E214,Pivots!$AX$3:$BA$45,3))/2+IF(C214=3,VLOOKUP(E214,Pivots!$AX$3:$BA$45,4))/2","v":84},11,{"$f":"VLOOKUP(A214,Players!$A$2:$B$92,2,FALSE)","v":"Alison Pritchard"},{"$f":"VLOOKUP(B214,Players!A$2:$B$92,2,FALSE)","v":"David Atthey"}]
["VC","JSI",3,19,25,{"$f":"IF(C215=1,VLOOKUP(E215,Pivots!$AX$3:$BA$45,2))/2+IF(C215=2,VLOOKUP(E215,Pivots!$AX$3:$BA$45,3))/2+IF(C215=3,VLOOKUP(E215,Pivots!$AX$3:$BA$45,4))/2","v":84},-2,{"$f":"VLOOKUP(A215,Players!$A$2:$B$92,2,FALSE)","v":"Val Constable"},{"$f":"VLOOKUP(B215,Players!A$2:$B$92,2,FALSE)","v":"Jim Simons"}]
["MB","JAR",3,17,25,{"$f":"IF(C216=1,VLOOKUP(E216,Pivots!$AX$3:$BA$45,2))/2+IF(C216=2,VLOOKUP(E216,Pivots!$AX$3:$BA$45,3))/2+IF(C216=3,VLOOKUP(E216,Pivots!$AX$3:$BA$45,4))/2","v":84},-4,{"$f":"VLOOKUP(A216,Players!$A$2:$B$92,2,FALSE)","v":"Mel Barlow"},{"$f":"VLOOKUP(B216,Players!A$2:$B$92,2,FALSE)","v":"John Arblaster"}]
["PW","RJ",3,16,25,{"$f":"IF(C217=1,VLOOKUP(E217,Pivots!$AX$3:$BA$45,2))/2+IF(C217=2,VLOOKUP(E217,Pivots!$AX$3:$BA$45,3))/2+IF(C217=3,VLOOKUP(E217,Pivots!$AX$3:$BA$45,4))/2","v":84},-5,{"$f":"VLOOKUP(A217,Players!$A$2:$B$92,2,FALSE)","v":"Peter Waggett"},{"$f":"VLOOKUP(B217,Players!A$2:$B$92,2,FALSE)","v":"Roger Jackson"}]
["PD","RPL",1,50.91,{"$f":"E206+1","v":26},{"$f":"IF(C218=1,VLOOKUP(E218,Pivots!$AX$3:$BA$45,2))/2+IF(C218=2,VLOOKUP(E218,Pivots!$AX$3:$BA$45,3))/2+IF(C218=3,VLOOKUP(E218,Pivots!$AX$3:$BA$45,4))/2","v":89.6},28.509999999999998,{"$f":"VLOOKUP(A218,Players!$A$2:$B$92,2,FALSE)","v":"Paul Denning"},{"$f":"VLOOKUP(B218,Players!A$2:$B$92,2,FALSE)","v":"Richard Plackett"}]
["RB","GW",1,4.18,{"$f":"E218","v":26},{"$f":"IF(C219=1,VLOOKUP(E219,Pivots!$AX$3:$BA$45,2))/2+IF(C219=2,VLOOKUP(E219,Pivots!$AX$3:$BA$45,3))/2+IF(C219=3,VLOOKUP(E219,Pivots!$AX$3:$BA$45,4))/2","v":89.6},-18.22,{"$f":"VLOOKUP(A219,Players!$A$2:$B$92,2,FALSE)","v":"Richard Butland"},{"$f":"VLOOKUP(B219,Players!A$2:$B$92,2,FALSE)","v":"Gary Watson"}]
["JAN","KST",1,-6.37,{"$f":"E219","v":26},{"$f":"IF(C220=1,VLOOKUP(E220,Pivots!$AX$3:$BA$45,2))/2+IF(C220=2,VLOOKUP(E220,Pivots!$AX$3:$BA$45,3))/2+IF(C220=3,VLOOKUP(E220,Pivots!$AX$3:$BA$45,4))/2","v":89.6},-28.77,{"$f":"VLOOKUP(A220,Players!$A$2:$B$92,2,FALSE)","v":"Joe Angseesing"},{"$f":"VLOOKUP(B220,Players!A$2:$B$92,2,FALSE)","v":"Keith Stanley"}]
["PSH","RCM",1,40.880000000000003,26,{"$f":"IF(C221=1,VLOOKUP(E221,Pivots!$AX$3:$BA$45,2))/2+IF(C221=2,VLOOKUP(E221,Pivots!$AX$3:$BA$45,3))/2+IF(C221=3,VLOOKUP(E221,Pivots!$AX$3:$BA$45,4))/2","v":89.6},18.480000000000004,{"$f":"VLOOKUP(A221,Players!$A$2:$B$92,2,FALSE)","v":"Patrick Shields"},{"$f":"VLOOKUP(B221,Players!A$2:$B$92,2,FALSE)","v":"Richard Chamberlain"}]
["JC","MR",2,19.899999999999999,26,{"$f":"IF(C222=1,VLOOKUP(E222,Pivots!$AX$3:$BA$45,2))/2+IF(C222=2,VLOOKUP(E222,Pivots!$AX$3:$BA$45,3))/2+IF(C222=3,VLOOKUP(E222,Pivots!$AX$3:$BA$45,4))/2","v":51.14},7.1149999999999984,{"$f":"VLOOKUP(A222,Players!$A$2:$B$92,2,FALSE)","v":"John Councer"},{"$f":"VLOOKUP(B222,Players!A$2:$B$92,2,FALSE)","v":"Mark Rogers"}]
["BR","RHA",2,11.36,26,{"$f":"IF(C223=1,VLOOKUP(E223,Pivots!$AX$3:$BA$45,2))/2+IF(C223=2,VLOOKUP(E223,Pivots!$AX$3:$BA$45,3))/2+IF(C223=3,VLOOKUP(E223,Pivots!$AX$3:$BA$45,4))/2","v":51.14},-1.4250000000000007,{"$f":"VLOOKUP(A223,Players!$A$2:$B$92,2,FALSE)","v":"Ben Ritacca"},{"$f":"VLOOKUP(B223,Players!A$2:$B$92,2,FALSE)","v":"Richard Harris"}]
["MW","PPH",2,10.15,26,{"$f":"IF(C224=1,VLOOKUP(E224,Pivots!$AX$3:$BA$45,2))/2+IF(C224=2,VLOOKUP(E224,Pivots!$AX$3:$BA$45,3))/2+IF(C224=3,VLOOKUP(E224,Pivots!$AX$3:$BA$45,4))/2","v":51.14},-2.6349999999999998,{"$f":"VLOOKUP(A224,Players!$A$2:$B$92,2,FALSE)","v":"Mike Wignall"},{"$f":"VLOOKUP(B224,Players!A$2:$B$92,2,FALSE)","v":"Patrick Phair"}]
["PSW","PL",2,9.73,26,{"$f":"IF(C225=1,VLOOKUP(E225,Pivots!$AX$3:$BA$45,2))/2+IF(C225=2,VLOOKUP(E225,Pivots!$AX$3:$BA$45,3))/2+IF(C225=3,VLOOKUP(E225,Pivots!$AX$3:$BA$45,4))/2","v":51.14},-3.0549999999999997,{"$f":"VLOOKUP(A225,Players!$A$2:$B$92,2,FALSE)","v":"Peter Swales"},{"$f":"VLOOKUP(B225,Players!A$2:$B$92,2,FALSE)","v":"Paul Lilley"}]
["AS","Jus",3,30.26,26,{"$f":"IF(C226=1,VLOOKUP(E226,Pivots!$AX$3:$BA$45,2))/2+IF(C226=2,VLOOKUP(E226,Pivots!$AX$3:$BA$45,3))/2+IF(C226=3,VLOOKUP(E226,Pivots!$AX$3:$BA$45,4))/2","v":-66.430000000000007},46.867500000000007,{"$f":"VLOOKUP(A226,Players!$A$2:$B$92,2,FALSE)","v":"Allan Sanis"},{"$f":"VLOOKUP(B226,Players!A$2:$B$92,2,FALSE)","v":"Judy Sanis"}]
["VC","JSI",3,19.12,26,{"$f":"IF(C227=1,VLOOKUP(E227,Pivots!$AX$3:$BA$45,2))/2+IF(C227=2,VLOOKUP(E227,Pivots!$AX$3:$BA$45,3))/2+IF(C227=3,VLOOKUP(E227,Pivots!$AX$3:$BA$45,4))/2","v":-66.430000000000007},35.727500000000006,{"$f":"VLOOKUP(A227,Players!$A$2:$B$92,2,FALSE)","v":"Val Constable"},{"$f":"VLOOKUP(B227,Players!A$2:$B$92,2,FALSE)","v":"Jim Simons"}]
["MB","JA",3,-47.55,26,{"$f":"IF(C228=1,VLOOKUP(E228,Pivots!$AX$3:$BA$45,2))/2+IF(C228=2,VLOOKUP(E228,Pivots!$AX$3:$BA$45,3))/2+IF(C228=3,VLOOKUP(E228,Pivots!$AX$3:$BA$45,4))/2","v":-66.430000000000007},-30.942499999999995,{"$f":"VLOOKUP(A228,Players!$A$2:$B$92,2,FALSE)","v":"Mel Barlow"},{"$f":"VLOOKUP(B228,Players!A$2:$B$92,2,FALSE)","v":{"$error":"#N/A"}}]
["PW","RJ",3,-68.260000000000005,26,{"$f":"IF(C229=1,VLOOKUP(E229,Pivots!$AX$3:$BA$45,2))/2+IF(C229=2,VLOOKUP(E229,Pivots!$AX$3:$BA$45,3))/2+IF(C229=3,VLOOKUP(E229,Pivots!$AX$3:$BA$45,4))/2","v":-66.430000000000007},-51.652500000000003,{"$f":"VLOOKUP(A229,Players!$A$2:$B$92,2,FALSE)","v":"Peter Waggett"},{"$f":"VLOOKUP(B229,Players!A$2:$B$92,2,FALSE)","v":"Roger Jackson"}]
[null,null,1,null,{"$f":"E218+1","v":27},{"$f":"IF(C230=1,VLOOKUP(E230,Pivots!$AX$3:$BA$45,2))/2+IF(C230=2,VLOOKUP(E230,Pivots!$AX$3:$BA$45,3))/2+IF(C230=3,VLOOKUP(E230,Pivots!$AX$3:$BA$45,4))/2","v":0},"",{"$f":"VLOOKUP(A230,Players!$A$2:$B$92,2,FALSE)","v":{"$error":"#N/A"}},{"$f":"VLOOKUP(B230,Players!A$2:$B$92,2,FALSE)","v":{"$error":"#N/A"}}]
[null,null,1,null,{"$f":"E230","v":27},{"$f":"IF(C231=1,VLOOKUP(E231,Pivots!$AX$3:$BA$45,2))/2+IF(C231=2,VLOOKUP(E231,Pivots!$AX$3:$BA$45,3))/2+IF(C231=3,VLOOKUP(E231,Pivots!$AX$3:$BA$45,4))/2","v":0},"",{"$f":"VLOOKUP(A231,Players!$A$2:$B$92,2,FALSE)","v":{"$error":"#N/A"}},{"$f":"VLOOKUP(B231,Players!A$2:$B$92,2,FALSE)","v":{"$error":"#N/A"}}]
[null,null,1,null,{"$f":"E231","v":27},{"$f":"IF(C232=1,VLOOKUP(E232,Pivots!$AX$3:$BA$45,2))/2+IF(C232=2,VLOOKUP(E232,Pivots!$AX$3:$BA$45,3))/2+IF(C232=3,VLOOKUP(E232,Pivots!$AX$3:$BA$45,4))/2","v":0},"",{"$f":"VLOOKUP(A232,Players!$A$2:$B$92,2,FALSE)","v":{"$error":"#N/A"}},{"$f":"VLOOKUP(B232,Players!A$2:$B$92,2,FALSE)","v":{"$error":"#N/A"}}]
[null,null,1,null,27,{"$f":"IF(C233=1,VLOOKUP(E233,Pivots!$AX$3:$BA$45,2))/2+IF(C233=2,VLOOKUP(E233,Pivots!$AX$3:$BA$45,3))/2+IF(C233=3,VLOOKUP(E233,Pivots!$AX$3:$BA$45,4))/2","v":0},"",{"$f":"VLOOKUP(A233,Players!$A$2:$B$92,2,FALSE)","v":{"$error":"#N/A"}},{"$f":"VLOOKUP(B233,Players!A$2:$B$92,2,FALSE)","v":{"$error":"#N/A"}}]
[null,null,2,null,27,{"$f":"IF(C234=1,VLOOKUP(E234,Pivots!$AX$3:$BA$45,2))/2+IF(C234=2,VLOOKUP(E234,Pivots!$AX$3:$BA$45,3))/2+IF(C234=3,VLOOKUP(E234,Pivots!$AX$3:$BA$45,4))/2","v":0},"",{"$f":"VLOOKUP(A234,Players!$A$2:$B$92,2,FALSE)","v":{"$error":"#N/A"}},{"$f":"VLOOKUP(B234,Players!A$2:$B$92,2,FALSE)","v":{"$error":"#N/A"}}]
[null,null,2,null,27,{"$f":"IF(C235=1,VLOOKUP(E235,Pivots!$AX$3:$BA$45,2))/2+IF(C235=2,VLOOKUP(E235,Pivots!$AX$3:$BA$45,3))/2+IF(C235=3,VLOOKUP(E235,Pivots!$AX$3:$BA$45,4))/2","v":0},"",{"$f":"VLOOKUP(A235,Players!$A$2:$B$92,2,FALSE)","v":{"$error":"#N/A"}},{"$f":"VLOOKUP(B235,Players!A$2:$B$92,2,FALSE)","v":{"$error":"#N/A"}}]
[null,null,2,null,27,{"$f":"IF(C236=1,VLOOKUP(E236,Pivots!$AX$3:$BA$45,2))/2+IF(C236=2,VLOOKUP(E236,Pivots!$AX$3:$BA$45,3))/2+IF(C236=3,VLOOKUP(E236,Pivots!$AX$3:$BA$45,4))/2","v":0},"",{"$f":"VLOOKUP(A236,Players!$A$2:$B$92,2,FALSE)","v":{"$error":"#N/A"}},{"$f":"VLOOKUP(B236,Players!A$2:$B$92,2,FALSE)","v":{"$error":"#N/A"}}]
[null,null,2,null,27,{"$f":"IF(C237=1,VLOOKUP(E237,Pivots!$AX$3:$BA$45,2))/2+IF(C237=2,VLOOKUP(E237,Pivots!$AX$3:$BA$45,3))/2+IF(C237=3,VLOOKUP(E237,Pivots!$AX$3:$BA$45,4))/2","v":0},"",{"$f":"VLOOKUP(A237,Players!$A$2:$B$92,2,FALSE)","v":{"$error":"#N/A"}},{"$f":"VLOOKUP(B237,Players!A$2:$B$92,2,FALSE)","v":{"$error":"#N/A"}}]
[null,null,3,null,27,{"$f":"IF(C238=1,VLOOKUP(E238,Pivots!$AX$3:$BA$45,2))/2+IF(C238=2,VLOOKUP(E238,Pivots!$AX$3:$BA$45,3))/2+IF(C238=3,VLOOKUP(E238,Pivots!$AX$3:$BA$45,4))/2","v":0},"",{"$f":"VLOOKUP(A238,Players!$A$2:$B$92,2,FALSE)","v":{"$error":"#N/A"}},{"$f":"VLOOKUP(B238,Players!A$2:$B$92,2,FALSE)","v":{"$error":"#N/A"}}]
[null,null,3,null,27,{"$f":"IF(C239=1,VLOOKUP(E239,Pivots!$AX$3:$BA$45,2))/2+IF(C239=2,VLOOKUP(E239,Pivots!$AX$3:$BA$45,3))/2+IF(C239=3,VLOOKUP(E239,Pivots!$AX$3:$BA$45,4))/2","v":0},"",{"$f":"VLOOKUP(A239,Players!$A$2:$B$92,2,FALSE)","v":{"$error":"#N/A"}},{"$f":"VLOOKUP(B239,Players!A$2:$B$92,2,FALSE)","v":{"$error":"#N/A"}}]
[null,null,3,null,27,{"$f":"IF(C240=1,VLOOKUP(E240,Pivots!$AX$3:$BA$45,2))/2+IF(C240=2,VLOOKUP(E240,Pivots!$AX$3:$BA$45,3))/2+IF(C240=3,VLOOKUP(E240,Pivots!$AX$3:$BA$45,4))/2","v":0},"",{"$f":"VLOOKUP(A240,Players!$A$2:$B$92,2,FALSE)","v":{"$error":"#N/A"}},{"$f":"VLOOKUP(B240,Players!A$2:$B$92,2,FALSE)","v":{"$error":"#N/A"}}]
[null,null,3,null,27,{"$f":"IF(C241=1,VLOOKUP(E241,Pivots!$AX$3:$BA$45,2))/2+IF(C241=2,VLOOKUP(E241,Pivots!$AX$3:$BA$45,3))/2+IF(C241=3,VLOOKUP(E241,Pivots!$AX$3:$BA$45,4))/2","v":0},"",{"$f":"VLOOKUP(A241,Players!$A$2:$B$92,2,FALSE)","v":{"$error":"#N/A"}},{"$f":"VLOOKUP(B241,Players!A$2:$B$92,2,FALSE)","v":{"$error":"#N/A"}}]
[null,null,1,null,31,{"$f":"IF(C242=1,VLOOKUP(E242,Pivots!$AX$3:$BA$45,2))/2+IF(C242=2,VLOOKUP(E242,Pivots!$AX$3:$BA$45,3))/2+IF(C242=3,VLOOKUP(E242,Pivots!$AX$3:$BA$45,4))/2","v":0},"",{"$f":"VLOOKUP(A242,Players!$A$2:$B$92,2,FALSE)","v":{"$error":"#N/A"}},{"$f":"VLOOKUP(B242,Players!A$2:$B$92,2,FALSE)","v":{"$error":"#N/A"}}]
[null,null,1,null,{"$f":"E242","v":31},{"$f":"IF(C243=1,VLOOKUP(E243,Pivots!$AX$3:$BA$45,2))/2+IF(C243=2,VLOOKUP(E243,Pivots!$AX$3:$BA$45,3))/2+IF(C243=3,VLOOKUP(E243,Pivots!$AX$3:$BA$45,4))/2","v":0},"",{"$f":"VLOOKUP(A243,Players!$A$2:$B$92,2,FALSE)","v":{"$error":"#N/A"}},{"$f":"VLOOKUP(B243,Players!A$2:$B$92,2,FALSE)","v":{"$error":"#N/A"}}]
[null,null,1,null,{"$f":"E243","v":31},{"$f":"IF(C244=1,VLOOKUP(E244,Pivots!$AX$3:$BA$45,2))/2+IF(C244=2,VLOOKUP(E244,Pivots!$AX$3:$BA$45,3))/2+IF(C244=3,VLOOKUP(E244,Pivots!$AX$3:$BA$45,4))/2","v":0},"",{"$f":"VLOOKUP(A244,Players!$A$2:$B$92,2,FALSE)","v":{"$error":"#N/A"}},{"$f":"VLOOKUP(B244,Players!A$2:$B$92,2,FALSE)","v":{"$error":"#N/A"}}]
[null,null,1,null,31,{"$f":"IF(C245=1,VLOOKUP(E245,Pivots!$AX$3:$BA$45,2))/2+IF(C245=2,VLOOKUP(E245,Pivots!$AX$3:$BA$45,3))/2+IF(C245=3,VLOOKUP(E245,Pivots!$AX$3:$BA$45,4))/2","v":0},"",{"$f":"VLOOKUP(A245,Players!$A$2:$B$92,2,FALSE)","v":{"$error":"#N/A"}},{"$f":"VLOOKUP(B245,Players!A$2:$B$92,2,FALSE)","v":{"$error":"#N/A"}}]
[null,null,2,null,31,{"$f":"IF(C246=1,VLOOKUP(E246,Pivots!$AX$3:$BA$45,2))/2+IF(C246=2,VLOOKUP(E246,Pivots!$AX$3:$BA$45,3))/2+IF(C246=3,VLOOKUP(E246,Pivots!$AX$3:$BA$45,4))/2","v":0},"",{"$f":"VLOOKUP(A246,Players!$A$2:$B$92,2,FALSE)","v":{"$error":"#N/A"}},{"$f":"VLOOKUP(B246,Players!A$2:$B$92,2,FALSE)","v":{"$error":"#N/A"}}]
[null,null,2,null,31,{"$f":"IF(C247=1,VLOOKUP(E247,Pivots!$AX$3:$BA$45,2))/2+IF(C247=2,VLOOKUP(E247,Pivots!$AX$3:$BA$45,3))/2+IF(C247=3,VLOOKUP(E247,Pivots!$AX$3:$BA$45,4))/2","v":0},"",{"$f":"VLOOKUP(A247,Players!$A$2:$B$92,2,FALSE)","v":{"$error":"#N/A"}},{"$f":"VLOOKUP(B247,Players!A$2:$B$92,2,FALSE)","v":{"$error":"#N/A"}}]
[null,null,2,null,31,{"$f":"IF(C248=1,VLOOKUP(E248,Pivots!$AX$3:$BA$45,2))/2+IF(C248=2,VLOOKUP(E248,Pivots!$AX$3:$BA$45,3))/2+IF(C248=3,VLOOKUP(E248,Pivots!$AX$3:$BA$45,4))/2","v":0},"",{"$f":"VLOOKUP(A248,Players!$A$2:$B$92,2,FALSE)","v":{"$error":"#N/A"}},{"$f":"VLOOKUP(B248,Players!A$2:$B$92,2,FALSE)","v":{"$error":"#N/A"}}]
[null,null,2,null,31,{"$f":"IF(C249=1,VLOOKUP(E249,Pivots!$AX$3:$BA$45,2))/2+IF(C249=2,VLOOKUP(E249,Pivots!$AX$3:$BA$45,3))/2+IF(C249=3,VLOOKUP(E249,Pivots!$AX$3:$BA$45,4))/2","v":0},"",{"$f":"VLOOKUP(A249,Players!$A$2:$B$92,2,FALSE)","v":{"$error":"#N/A"}},{"$f":"VLOOKUP(B249,Players!A$2:$B$92,2,FALSE)","v":{"$error":"#N/A"}}]
[null,null,3,null,31,{"$f":"IF(C250=1,VLOOKUP(E250,Pivots!$AX$3:$BA$45,2))/2+IF(C250=2,VLOOKUP(E250,Pivots!$AX$3:$BA$45,3))/2+IF(C250=3,VLOOKUP(E250,Pivots!$AX$3:$BA$45,4))/2","v":0},"",{"$f":"VLOOKUP(A250,Players!$A$2:$B$92,2,FALSE)","v":{"$error":"#N/A"}},{"$f":"VLOOKUP(B250,Players!A$2:$B$92,2,FALSE)","v":{"$error":"#N/A"}}]
[null,null,3,null,31,{"$f":"IF(C251=1,VLOOKUP(E251,Pivots!$AX$3:$BA$45,2))/2+IF(C251=2,VLOOKUP(E251,Pivots!$AX$3:$BA$45,3))/2+IF(C251=3,VLOOKUP(E251,Pivots!$AX$3:$BA$45,4))/2","v":0},"",{"$f":"VLOOKUP(A251,Players!$A$2:$B$92,2,FALSE)","v":{"$error":"#N/A"}},{"$f":"VLOOKUP(B251,Players!A$2:$B$92,2,FALSE)","v":{"$error":"#N/A"}}]
[null,null,3,null,31,{"$f":"IF(C252=1,VLOOKUP(E252,Pivots!$AX$3:$BA$45,2))/2+IF(C252=2,VLOOKUP(E252,Pivots!$AX$3:$BA$45,3))/2+IF(C252=3,VLOOKUP(E252,Pivots!$AX$3:$BA$45,4))/2","v":0},"",{"$f":"VLOOKUP(A252,Players!$A$2:$B$92,2,FALSE)","v":{"$error":"#N/A"}},{"$f":"VLOOKUP(B252,Players!A$2:$B$92,2,FALSE)","v":{"$error":"#N/A"}}]
[null,null,3,null,31,{"$f":"IF(C253=1,VLOOKUP(E253,Pivots!$AX$3:$BA$45,2))/2+IF(C253=2,VLOOKUP(E253,Pivots!$AX$3:$BA$45,3))/2+IF(C253=3,VLOOKUP(E253,Pivots!$AX$3:$BA$45,4))/2","v":0},"",{"$f":"VLOOKUP(A253,Players!$A$2:$B$92,2,FALSE)","v":{"$error":"#N/A"}},{"$f":"VLOOKUP(B253,Players!A$2:$B$92,2,FALSE)","v":{"$error":"#N/A"}}]
[null,null,1,null,{"$f":"E242+1","v":32},{"$f":"IF(C254=1,VLOOKUP(E254,Pivots!$AX$3:$BA$45,2))/2+IF(C254=2,VLOOKUP(E254,Pivots!$AX$3:$BA$45,3))/2+IF(C254=3,VLOOKUP(E254,Pivots!$AX$3:$BA$45,4))/2","v":0},"",{"$f":"VLOOKUP(A254,Players!$A$2:$B$92,2,FALSE)","v":{"$error":"#N/A"}},{"$f":"VLOOKUP(B254,Players!A$2:$B$92,2,FALSE)","v":{"$error":"#N/A"}}]
[null,null,1,null,{"$f":"E254","v":32},{"$f":"IF(C255=1,VLOOKUP(E255,Pivots!$AX$3:$BA$45,2))/2+IF(C255=2,VLOOKUP(E255,Pivots!$AX$3:$BA$45,3))/2+IF(C255=3,VLOOKUP(E255,Pivots!$AX$3:$BA$45,4))/2","v":0},"",{"$f":"VLOOKUP(A255,Players!$A$2:$B$92,2,FALSE)","v":{"$error":"#N/A"}},{"$f":"VLOOKUP(B255,Players!A$2:$B$92,2,FALSE)","v":{"$error":"#N/A"}}]
[null,null,1,null,{"$f":"E255","v":32},{"$f":"IF(C256=1,VLOOKUP(E256,Pivots!$AX$3:$BA$45,2))/2+IF(C256=2,VLOOKUP(E256,Pivots!$AX$3:$BA$45,3))/2+IF(C256=3,VLOOKUP(E256,Pivots!$AX$3:$BA$45,4))/2","v":0},"",{"$f":"VLOOKUP(A256,Players!$A$2:$B$92,2,FALSE)","v":{"$error":"#N/A"}},{"$f":"VLOOKUP(B256,Players!A$2:$B$92,2,FALSE)","v":{"$error":"#N/A"}}]
[null,null,1,null,32,{"$f":"IF(C257=1,VLOOKUP(E257,Pivots!$AX$3:$BA$45,2))/2+IF(C257=2,VLOOKUP(E257,Pivots!$AX$3:$BA$45,3))/2+IF(C257=3,VLOOKUP(E257,Pivots!$AX$3:$BA$45,4))/2","v":0},"",{"$f":"VLOOKUP(A257,Players!$A$2:$B$92,2,FALSE)","v":{"$error":"#N/A"}},{"$f":"VLOOKUP(B257,Players!A$2:$B$92,2,FALSE)","v":{"$error":"#N/A"}}]
[null,null,2,null,32,{"$f":"IF(C258=1,VLOOKUP(E258,Pivots!$AX$3:$BA$45,2))/2+IF(C258=2,VLOOKUP(E258,Pivots!$AX$3:$BA$45,3))/2+IF(C258=3,VLOOKUP(E258,Pivots!$AX$3:$BA$45,4))/2","v":0},{"$f":"IF(A258=\"\",\"\",D258-F258/4)","v":""},{"$f":"VLOOKUP(A258,Players!$A$2:$B$92,2,FALSE)","v":{"$error":"#N/A"}},{"$f":"VLOOKUP(B258,Players!A$2:$B$92,2,FALSE)","v":{"$error":"#N/A"}}]
[null,null,2,null,32,{"$f":"IF(C259=1,VLOOKUP(E259,Pivots!$AX$3:$BA$45,2))/2+IF(C259=2,VLOOKUP(E259,Pivots!$AX$3:$BA$45,3))/2+IF(C259=3,VLOOKUP(E259,Pivots!$AX$3:$BA$45,4))/2","v":0},"",{"$f":"VLOOKUP(A259,Players!$A$2:$B$92,2,FALSE)","v":{"$error":"#N/A"}},{"$f":"VLOOKUP(B259,Players!A$2:$B$92,2,FALSE)","v":{"$error":"#N/A"}}]
[null,null,2,null,32,{"$f":"IF(C260=1,VLOOKUP(E260,Pivots!$AX$3:$BA$45,2))/2+IF(C260=2,VLOOKUP(E260,Pivots!$AX$3:$BA$45,3))/2+IF(C260=3,VLOOKUP(E260,Pivots!$AX$3:$BA$45,4))/2","v":0},"",{"$f":"VLOOKUP(A260,Players!$A$2:$B$92,2,FALSE)","v":{"$error":"#N/A"}},{"$f":"VLOOKUP(B260,Players!A$2:$B$92,2,FALSE)","v":{"$error":"#N/A"}}]
[null,null,2,null,32,{"$f":"IF(C261=1,VLOOKUP(E261,Pivots!$AX$3:$BA$45,2))/2+IF(C261=2,VLOOKUP(E261,Pivots!$AX$3:$BA$45,3))/2+IF(C261=3,VLOOKUP(E261,Pivots!$AX$3:$BA$45,4))/2","v":0},"",{"$f":"VLOOKUP(A261,Players!$A$2:$B$92,2,FALSE)","v":{"$error":"#N/A"}},{"$f":"VLOOKUP(B261,Players!A$2:$B$92,2,FALSE)","v":{"$error":"#N/A"}}]
[null,null,3,null,32,{"$f":"IF(C262=1,VLOOKUP(E262,Pivots!$AX$3:$BA$45,2))/2+IF(C262=2,VLOOKUP(E262,Pivots!$AX$3:$BA$45,3))/2+IF(C262=3,VLOOKUP(E262,Pivots!$AX$3:$BA$45,4))/2","v":0},"",{"$f":"VLOOKUP(A262,Players!$A$2:$B$92,2,FALSE)","v":{"$error":"#N/A"}},{"$f":"VLOOKUP(B262,Players!A$2:$B$92,2,FALSE)","v":{"$error":"#N/A"}}]
[null,null,3,null,32,{"$f":"IF(C263=1,VLOOKUP(E263,Pivots!$AX$3:$BA$45,2))/2+IF(C263=2,VLOOKUP(E263,Pivots!$AX$3:$BA$45,3))/2+IF(C263=3,VLOOKUP(E263,Pivots!$AX$3:$BA$45,4))/2","v":0},"",{"$f":"VLOOKUP(A263,Players!$A$2:$B$92,2,FALSE)","v":{"$error":"#N/A"}},{"$f":"VLOOKUP(B263,Players!A$2:$B$92,2,FALSE)","v":{"$error":"#N/A"}}]
[null,null,3,null,32,{"$f":"IF(C264=1,VLOOKUP(E264,Pivots!$AX$3:$BA$45,2))/2+IF(C264=2,VLOOKUP(E264,Pivots!$AX$3:$BA$45,3))/2+IF(C264=3,VLOOKUP(E264,Pivots!$AX$3:$BA$45,4))/2","v":0},"",{"$f":"VLOOKUP(A264,Players!$A$2:$B$92,2,FALSE)","v":{"$error":"#N/A"}},{"$f":"VLOOKUP(B264,Players!A$2:$B$92,2,FALSE)","v":{"$error":"#N/A"}}]
[null,null,3,null,32,{"$f":"IF(C265=1,VLOOKUP(E265,Pivots!$AX$3:$BA$45,2))/2+IF(C265=2,VLOOKUP(E265,Pivots!$AX$3:$BA$45,3))/2+IF(C265=3,VLOOKUP(E265,Pivots!$AX$3:$BA$45,4))/2","v":0},"",{"$f":"VLOOKUP(A265,Players!$A$2:$B$92,2,FALSE)","v":{"$error":"#N/A"}},{"$f":"VLOOKUP(B265,Players!A$2:$B$92,2,FALSE)","v":{"$error":"#N/A"}}]
[null,null,1,null,{"$f":"E254+1","v":33},{"$f":"IF(C266=1,VLOOKUP(E266,Pivots!$AX$3:$BA$45,2))/2+IF(C266=2,VLOOKUP(E266,Pivots!$AX$3:$BA$45,3))/2+IF(C266=3,VLOOKUP(E266,Pivots!$AX$3:$BA$45,4))/2","v":0},"",{"$f":"VLOOKUP(A266,Players!$A$2:$B$92,2,FALSE)","v":{"$error":"#N/A"}},{"$f":"VLOOKUP(B266,Players!A$2:$B$92,2,FALSE)","v":{"$error":"#N/A"}}]
[null,null,1,null,{"$f":"E266","v":33},{"$f":"IF(C267=1,VLOOKUP(E267,Pivots!$AX$3:$BA$45,2))/2+IF(C267=2,VLOOKUP(E267,Pivots!$AX$3:$BA$45,3))/2+IF(C267=3,VLOOKUP(E267,Pivots!$AX$3:$BA$45,4))/2","v":0},"",{"$f":"VLOOKUP(A267,Players!$A$2:$B$92,2,FALSE)","v":{"$error":"#N/A"}},{"$f":"VLOOKUP(B267,Players!A$2:$B$92,2,FALSE)","v":{"$error":"#N/A"}}]
[null,null,1,null,{"$f":"E267","v":33},{"$f":"IF(C268=1,VLOOKUP(E268,Pivots!$AX$3:$BA$45,2))/2+IF(C268=2,VLOOKUP(E268,Pivots!$AX$3:$BA$45,3))/2+IF(C268=3,VLOOKUP(E268,Pivots!$AX$3:$BA$45,4))/2","v":0},"",{"$f":"VLOOKUP(A268,Players!$A$2:$B$92,2,FALSE)","v":{"$error":"#N/A"}},{"$f":"VLOOKUP(B268,Players!A$2:$B$92,2,FALSE)","v":{"$error":"#N/A"}}]
[null,null,1,null,33,{"$f":"IF(C269=1,VLOOKUP(E269,Pivots!$AX$3:$BA$45,2))/2+IF(C269=2,VLOOKUP(E269,Pivots!$AX$3:$BA$45,3))/2+IF(C269=3,VLOOKUP(E269,Pivots!$AX$3:$BA$45,4))/2","v":0},"",{"$f":"VLOOKUP(A269,Players!$A$2:$B$92,2,FALSE)","v":{"$error":"#N/A"}},{"$f":"VLOOKUP(B269,Players!A$2:$B$92,2,FALSE)","v":{"$error":"#N/A"}}]
[null,null,2,null,33,{"$f":"IF(C270=1,VLOOKUP(E270,Pivots!$AX$3:$BA$45,2))/2+IF(C270=2,VLOOKUP(E270,Pivots!$AX$3:$BA$45,3))/2+IF(C270=3,VLOOKUP(E270,Pivots!$AX$3:$BA$45,4))/2","v":0},"",{"$f":"VLOOKUP(A270,Players!$A$2:$B$92,2,FALSE)","v":{"$error":"#N/A"}},{"$f":"VLOOKUP(B270,Players!A$2:$B$92,2,FALSE)","v":{"$error":"#N/A"}}]
[null,null,2,null,33,{"$f":"IF(C271=1,VLOOKUP(E271,Pivots!$AX$3:$BA$45,2))/2+IF(C271=2,VLOOKUP(E271,Pivots!$AX$3:$BA$45,3))/2+IF(C271=3,VLOOKUP(E271,Pivots!$AX$3:$BA$45,4))/2","v":0},"",{"$f":"VLOOKUP(A271,Players!$A$2:$B$92,2,FALSE)","v":{"$error":"#N/A"}},{"$f":"VLOOKUP(B271,Players!A$2:$B$92,2,FALSE)","v":{"$error":"#N/A"}}]
[null,null,2,null,33,{"$f":"IF(C272=1,VLOOKUP(E272,Pivots!$AX$3:$BA$45,2))/2+IF(C272=2,VLOOKUP(E272,Pivots!$AX$3:$BA$45,3))/2+IF(C272=3,VLOOKUP(E272,Pivots!$AX$3:$BA$45,4))/2","v":0},"",{"$f":"VLOOKUP(A272,Players!$A$2:$B$92,2,FALSE)","v":{"$error":"#N/A"}},{"$f":"VLOOKUP(B272,Players!A$2:$B$92,2,FALSE)","v":{"$error":"#N/A"}}]
[null,null,2,null,33,{"$f":"IF(C273=1,VLOOKUP(E273,Pivots!$AX$3:$BA$45,2))/2+IF(C273=2,VLOOKUP(E273,Pivots!$AX$3:$BA$45,3))/2+IF(C273=3,VLOOKUP(E273,Pivots!$AX$3:$BA$45,4))/2","v":0},"",{"$f":"VLOOKUP(A273,Players!$A$2:$B$92,2,FALSE)","v":{"$error":"#N/A"}},{"$f":"VLOOKUP(B273,Players!A$2:$B$92,2,FALSE)","v":{"$error":"#N/A"}}]
[null,null,3,null,33,{"$f":"IF(C274=1,VLOOKUP(E274,Pivots!$AX$3:$BA$45,2))/2+IF(C274=2,VLOOKUP(E274,Pivots!$AX$3:$BA$45,3))/2+IF(C274=3,VLOOKUP(E274,Pivots!$AX$3:$BA$45,4))/2","v":0},"",{"$f":"VLOOKUP(A274,Players!$A$2:$B$92,2,FALSE)","v":{"$error":"#N/A"}},{"$f":"VLOOKUP(B274,Players!A$2:$B$92,2,FALSE)","v":{"$error":"#N/A"}}]
[null,null,3,null,33,{"$f":"IF(C275=1,VLOOKUP(E275,Pivots!$AX$3:$BA$45,2))/2+IF(C275=2,VLOOKUP(E275,Pivots!$AX$3:$BA$45,3))/2+IF(C275=3,VLOOKUP(E275,Pivots!$AX$3:$BA$45,4))/2","v":0},"",{"$f":"VLOOKUP(A275,Players!$A$2:$B$92,2,FALSE)","v":{"$error":"#N/A"}},{"$f":"VLOOKUP(B275,Players!A$2:$B$92,2,FALSE)","v":{"$error":"#N/A"}}]
[null,null,3,null,33,{"$f":"IF(C276=1,VLOOKUP(E276,Pivots!$AX$3:$BA$45,2))/2+IF(C276=2,VLOOKUP(E276,Pivots!$AX$3:$BA$45,3))/2+IF(C276=3,VLOOKUP(E276,Pivots!$AX$3:$BA$45,4))/2","v":0},"",{"$f":"VLOOKUP(A276,Players!$A$2:$B$92,2,FALSE)","v":{"$error":"#N/A"}},{"$f":"VLOOKUP(B276,Players!A$2:$B$92,2,FALSE)","v":{"$error":"#N/A"}}]
[null,null,3,null,33,{"$f":"IF(C277=1,VLOOKUP(E277,Pivots!$AX$3:$BA$45,2))/2+IF(C277=2,VLOOKUP(E277,Pivots!$AX$3:$BA$45,3))/2+IF(C277=3,VLOOKUP(E277,Pivots!$AX$3:$BA$45,4))/2","v":0},"",{"$f":"VLOOKUP(A277,Players!$A$2:$B$92,2,FALSE)","v":{"$error":"#N/A"}},{"$f":"VLOOKUP(B277,Players!A$2:$B$92,2,FALSE)","v":{"$error":"#N/A"}}]
[null,null,1,null,{"$f":"E266+1","v":34},{"$f":"IF(C278=1,VLOOKUP(E278,Pivots!$AX$3:$BA$45,2))/2+IF(C278=2,VLOOKUP(E278,Pivots!$AX$3:$BA$45,3))/2+IF(C278=3,VLOOKUP(E278,Pivots!$AX$3:$BA$45,4))/2","v":0},"",{"$f":"VLOOKUP(A278,Players!$A$2:$B$92,2,FALSE)","v":{"$error":"#N/A"}},{"$f":"VLOOKUP(B278,Players!A$2:$B$92,2,FALSE)","v":{"$error":"#N/A"}}]
[null,null,1,null,{"$f":"E278","v":34},{"$f":"IF(C279=1,VLOOKUP(E279,Pivots!$AX$3:$BA$45,2))/2+IF(C279=2,VLOOKUP(E279,Pivots!$AX$3:$BA$45,3))/2+IF(C279=3,VLOOKUP(E279,Pivots!$AX$3:$BA$45,4))/2","v":0},"",{"$f":"VLOOKUP(A279,Players!$A$2:$B$92,2,FALSE)","v":{"$error":"#N/A"}},{"$f":"VLOOKUP(B279,Players!A$2:$B$92,2,FALSE)","v":{"$error":"#N/A"}}]
[null,null,1,null,{"$f":"E279","v":34},{"$f":"IF(C280=1,VLOOKUP(E280,Pivots!$AX$3:$BA$45,2))/2+IF(C280=2,VLOOKUP(E280,Pivots!$AX$3:$BA$45,3))/2+IF(C280=3,VLOOKUP(E280,Pivots!$AX$3:$BA$45,4))/2","v":0},"",{"$f":"VLOOKUP(A280,Players!$A$2:$B$92,2,FALSE)","v":{"$error":"#N/A"}},{"$f":"VLOOKUP(B280,Players!A$2:$B$92,2,FALSE)","v":{"$error":"#N/A"}}]
[null,null,1,null,34,{"$f":"IF(C281=1,VLOOKUP(E281,Pivots!$AX$3:$BA$45,2))/2+IF(C281=2,VLOOKUP(E281,Pivots!$AX$3:$BA$45,3))/2+IF(C281=3,VLOOKUP(E281,Pivots!$AX$3:$BA$45,4))/2","v":0},"",{"$f":"VLOOKUP(A281,Players!$A$2:$B$92,2,FALSE)","v":{"$error":"#N/A"}},{"$f":"VLOOKUP(B281,Players!A$2:$B$92,2,FALSE)","v":{"$error":"#N/A"}}]
[null,null,2,null,34,{"$f":"IF(C282=1,VLOOKUP(E282,Pivots!$AX$3:$BA$45,2))/2+IF(C282=2,VLOOKUP(E282,Pivots!$AX$3:$BA$45,3))/2+IF(C282=3,VLOOKUP(E282,Pivots!$AX$3:$BA$45,4))/2","v":0},"",{"$f":"VLOOKUP(A282,Players!$A$2:$B$92,2,FALSE)","v":{"$error":"#N/A"}},{"$f":"VLOOKUP(B282,Players!A$2:$B$92,2,FALSE)","v":{"$error":"#N/A"}}]
[null,null,2,null,34,{"$f":"IF(C283=1,VLOOKUP(E283,Pivots!$AX$3:$BA$45,2))/2+IF(C283=2,VLOOKUP(E283,Pivots!$AX$3:$BA$45,3))/2+IF(C283=3,VLOOKUP(E283,Pivots!$AX$3:$BA$45,4))/2","v":0},"",{"$f":"VLOOKUP(A283,Players!$A$2:$B$92,2,FALSE)","v":{"$error":"#N/A"}},{"$f":"VLOOKUP(B283,Players!A$2:$B$92,2,FALSE)","v":{"$error":"#N/A"}}]
[null,null,2,null,34,{"$f":"IF(C284=1,VLOOKUP(E284,Pivots!$AX$3:$BA$45,2))/2+IF(C284=2,VLOOKUP(E284,Pivots!$AX$3:$BA$45,3))/2+IF(C284=3,VLOOKUP(E284,Pivots!$AX$3:$BA$45,4))/2","v":0},"",{"$f":"VLOOKUP(A284,Players!$A$2:$B$92,2,FALSE)","v":{"$error":"#N/A"}},{"$f":"VLOOKUP(B284,Players!A$2:$B$92,2,FALSE)","v":{"$error":"#N/A"}}]
[null,null,2,null,34,{"$f":"IF(C285=1,VLOOKUP(E285,Pivots!$AX$3:$BA$45,2))/2+IF(C285=2,VLOOKUP(E285,Pivots!$AX$3:$BA$45,3))/2+IF(C285=3,VLOOKUP(E285,Pivots!$AX$3:$BA$45,4))/2","v":0},"",{"$f":"VLOOKUP(A285,Players!$A$2:$B$92,2,FALSE)","v":{"$error":"#N/A"}},{"$f":"VLOOKUP(B285,Players!A$2:$B$92,2,FALSE)","v":{"$error":"#N/A"}}]
[null,null,3,null,34,{"$f":"IF(C286=1,VLOOKUP(E286,Pivots!$AX$3:$BA$45,2))/2+IF(C286=2,VLOOKUP(E286,Pivots!$AX$3:$BA$45,3))/2+IF(C286=3,VLOOKUP(E286,Pivots!$AX$3:$BA$45,4))/2","v":0},"",{"$f":"VLOOKUP(A286,Players!$A$2:$B$92,2,FALSE)","v":{"$error":"#N/A"}},{"$f":"VLOOKUP(B286,Players!A$2:$B$92,2,FALSE)","v":{"$error":"#N/A"}}]
[null,null,3,null,34,{"$f":"IF(C287=1,VLOOKUP(E287,Pivots!$AX$3:$BA$45,2))/2+IF(C287=2,VLOOKUP(E287,Pivots!$AX$3:$BA$45,3))/2+IF(C287=3,VLOOKUP(E287,Pivots!$AX$3:$BA$45,4))/2","v":0},"",{"$f":"VLOOKUP(A287,Players!$A$2:$B$92,2,FALSE)","v":{"$error":"#N/A"}},{"$f":"VLOOKUP(B287,Players!A$2:$B$92,2,FALSE)","v":{"$error":"#N/A"}}]
[null,null,3,null,34,{"$f":"IF(C288=1,VLOOKUP(E288,Pivots!$AX$3:$BA$45,2))/2+IF(C288=2,VLOOKUP(E288,Pivots!$AX$3:$BA$45,3))/2+IF(C288=3,VLOOKUP(E288,Pivots!$AX$3:$BA$45,4))/2","v":0},"",{"$f":"VLOOKUP(A288,Players!$A$2:$B$92,2,FALSE)","v":{"$error":"#N/A"}},{"$f":"VLOOKUP(B288,Players!A$2:$B$92,2,FALSE)","v":{"$error":"#N/A"}}]
[null,null,3,null,34,{"$f":"IF(C289=1,VLOOKUP(E289,Pivots!$AX$3:$BA$45,2))/2+IF(C289=2,VLOOKUP(E289,Pivots!$AX$3:$BA$45,3))/2+IF(C289=3,VLOOKUP(E289,Pivots!$AX$3:$BA$45,4))/2","v":0},"",{"$f":"VLOOKUP(A289,Players!$A$2:$B$92,2,FALSE)","v":{"$error":"#N/A"}},{"$f":"VLOOKUP(B289,Players!A$2:$B$92,2,FALSE)","v":{"$error":"#N/A"}}]
[null,null,1,null,{"$f":"E278+1","v":35},{"$f":"IF(C290=1,VLOOKUP(E290,Pivots!$AX$3:$BA$45,2))/2+IF(C290=2,VLOOKUP(E290,Pivots!$AX$3:$BA$45,3))/2+IF(C290=3,VLOOKUP(E290,Pivots!$AX$3:$BA$45,4))/2","v":0},"",{"$f":"VLOOKUP(A290,Players!$A$2:$B$92,2,FALSE)","v":{"$error":"#N/A"}},{"$f":"VLOOKUP(B290,Players!A$2:$B$92,2,FALSE)","v":{"$error":"#N/A"}}]
[null,null,1,null,{"$f":"E290","v":35},{"$f":"IF(C291=1,VLOOKUP(E291,Pivots!$AX$3:$BA$45,2))/2+IF(C291=2,VLOOKUP(E291,Pivots!$AX$3:$BA$45,3))/2+IF(C291=3,VLOOKUP(E291,Pivots!$AX$3:$BA$45,4))/2","v":0},"",{"$f":"VLOOKUP(A291,Players!$A$2:$B$92,2,FALSE)","v":{"$error":"#N/A"}},{"$f":"VLOOKUP(B291,Players!A$2:$B$92,2,FALSE)","v":{"$error":"#N/A"}}]
[null,null,1,null,{"$f":"E291","v":35},{"$f":"IF(C292=1,VLOOKUP(E292,Pivots!$AX$3:$BA$45,2))/2+IF(C292=2,VLOOKUP(E292,Pivots!$AX$3:$BA$45,3))/2+IF(C292=3,VLOOKUP(E292,Pivots!$AX$3:$BA$45,4))/2","v":0},"",{"$f":"VLOOKUP(A292,Players!$A$2:$B$92,2,FALSE)","v":{"$error":"#N/A"}},{"$f":"VLOOKUP(B292,Players!A$2:$B$92,2,FALSE)","v":{"$error":"#N/A"}}]
[null,null,1,null,35,{"$f":"IF(C293=1,VLOOKUP(E293,Pivots!$AX$3:$BA$45,2))/2+IF(C293=2,VLOOKUP(E293,Pivots!$AX$3:$BA$45,3))/2+IF(C293=3,VLOOKUP(E293,Pivots!$AX$3:$BA$45,4))/2","v":0},"",{"$f":"VLOOKUP(A293,Players!$A$2:$B$92,2,FALSE)","v":{"$error":"#N/A"}},{"$f":"VLOOKUP(B293,Players!A$2:$B$92,2,FALSE)","v":{"$error":"#N/A"}}]
[null,null,2,null,35,{"$f":"IF(C294=1,VLOOKUP(E294,Pivots!$AX$3:$BA$45,2))/2+IF(C294=2,VLOOKUP(E294,Pivots!$AX$3:$BA$45,3))/2+IF(C294=3,VLOOKUP(E294,Pivots!$AX$3:$BA$45,4))/2","v":0},"",{"$f":"VLOOKUP(A294,Players!$A$2:$B$92,2,FALSE)","v":{"$error":"#N/A"}},{"$f":"VLOOKUP(B294,Players!A$2:$B$92,2,FALSE)","v":{"$error":"#N/A"}}]
[null,null,2,null,35,{"$f":"IF(C295=1,VLOOKUP(E295,Pivots!$AX$3:$BA$45,2))/2+IF(C295=2,VLOOKUP(E295,Pivots!$AX$3:$BA$45,3))/2+IF(C295=3,VLOOKUP(E295,Pivots!$AX$3:$BA$45,4))/2","v":0},"",{"$f":"VLOOKUP(A295,Players!$A$2:$B$92,2,FALSE)","v":{"$error":"#N/A"}},{"$f":"VLOOKUP(B295,Players!A$2:$B$92,2,FALSE)","v":{"$error":"#N/A"}}]
[null,null,2,null,35,{"$f":"IF(C296=1,VLOOKUP(E296,Pivots!$AX$3:$BA$45,2))/2+IF(C296=2,VLOOKUP(E296,Pivots!$AX$3:$BA$45,3))/2+IF(C296=3,VLOOKUP(E296,Pivots!$AX$3:$BA$45,4))/2","v":0},"",{"$f":"VLOOKUP(A296,Players!$A$2:$B$92,2,FALSE)","v":{"$error":"#N/A"}},{"$f":"VLOOKUP(B296,Players!A$2:$B$92,2,FALSE)","v":{"$error":"#N/A"}}]
[null,null,2,null,35,{"$f":"IF(C297=1,VLOOKUP(E297,Pivots!$AX$3:$BA$45,2))/2+IF(C297=2,VLOOKUP(E297,Pivots!$AX$3:$BA$45,3))/2+IF(C297=3,VLOOKUP(E297,Pivots!$AX$3:$BA$45,4))/2","v":0},"",{"$f":"VLOOKUP(A297,Players!$A$2:$B$92,2,FALSE)","v":{"$error":"#N/A"}},{"$f":"VLOOKUP(B297,Players!A$2:$B$92,2,FALSE)","v":{"$error":"#N/A"}}]
[null,null,3,null,35,{"$f":"IF(C298=1,VLOOKUP(E298,Pivots!$AX$3:$BA$45,2))/2+IF(C298=2,VLOOKUP(E298,Pivots!$AX$3:$BA$45,3))/2+IF(C298=3,VLOOKUP(E298,Pivots!$AX$3:$BA$45,4))/2","v":0},"",{"$f":"VLOOKUP(A298,Players!$A$2:$B$92,2,FALSE)","v":{"$error":"#N/A"}},{"$f":"VLOOKUP(B298,Players!A$2:$B$92,2,FALSE)","v":{"$error":"#N/A"}}]
[null,null,3,null,35,{"$f":"IF(C299=1,VLOOKUP(E299,Pivots!$AX$3:$BA$45,2))/2+IF(C299=2,VLOOKUP(E299,Pivots!$AX$3:$BA$45,3))/2+IF(C299=3,VLOOKUP(E299,Pivots!$AX$3:$BA$45,4))/2","v":0},"",{"$f":"VLOOKUP(A299,Players!$A$2:$B$92,2,FALSE)","v":{"$error":"#N/A"}},{"$f":"VLOOKUP(B299,Players!A$2:$B$92,2,FALSE)","v":{"$error":"#N/A"}}]
[null,null,3,null,35,{"$f":"IF(C300=1,VLOOKUP(E300,Pivots!$AX$3:$BA$45,2))/2+IF(C300=2,VLOOKUP(E300,Pivots!$AX$3:$BA$45,3))/2+IF(C300=3,VLOOKUP(E300,Pivots!$AX$3:$BA$45,4))/2","v":0},"",{"$f":"VLOOKUP(A300,Players!$A$2:$B$92,2,FALSE)","v":{"$error":"#N/A"}},{"$f":"VLOOKUP(B300,Players!A$2:$B$92,2,FALSE)","v":{"$error":"#N/A"}}]
[null,null,3,null,35,{"$f":"IF(C301=1,VLOOKUP(E301,Pivots!$AX$3:$BA$45,2))/2+IF(C301=2,VLOOKUP(E301,Pivots!$AX$3:$BA$45,3))/2+IF(C301=3,VLOOKUP(E301,Pivots!$AX$3:$BA$45,4))/2","v":0},"",{"$f":"VLOOKUP(A301,Players!$A$2:$B$92,2,FALSE)","v":{"$error":"#N/A"}},{"$f":"VLOOKUP(B301,Players!A$2:$B$92,2,FALSE)","v":{"$error":"#N/A"}}]
[null,null,1,null,{"$f":"E290+1","v":36},{"$f":"IF(C302=1,VLOOKUP(E302,Pivots!$AX$3:$BA$45,2))/2+IF(C302=2,VLOOKUP(E302,Pivots!$AX$3:$BA$45,3))/2+IF(C302=3,VLOOKUP(E302,Pivots!$AX$3:$BA$45,4))/2","v":0},"",{"$f":"VLOOKUP(A302,Players!$A$2:$B$92,2,FALSE)","v":{"$error":"#N/A"}},{"$f":"VLOOKUP(B302,Players!A$2:$B$92,2,FALSE)","v":{"$error":"#N/A"}}]
[null,null,1,null,{"$f":"E302","v":36},{"$f":"IF(C303=1,VLOOKUP(E303,Pivots!$AX$3:$BA$45,2))/2+IF(C303=2,VLOOKUP(E303,Pivots!$AX$3:$BA$45,3))/2+IF(C303=3,VLOOKUP(E303,Pivots!$AX$3:$BA$45,4))/2","v":0},"",{"$f":"VLOOKUP(A303,Players!$A$2:$B$92,2,FALSE)","v":{"$error":"#N/A"}},{"$f":"VLOOKUP(B303,Players!A$2:$B$92,2,FALSE)","v":{"$error":"#N/A"}}]
[null,null,1,null,{"$f":"E303","v":36},{"$f":"IF(C304=1,VLOOKUP(E304,Pivots!$AX$3:$BA$45,2))/2+IF(C304=2,VLOOKUP(E304,Pivots!$AX$3:$BA$45,3))/2+IF(C304=3,VLOOKUP(E304,Pivots!$AX$3:$BA$45,4))/2","v":0},"",{"$f":"VLOOKUP(A304,Players!$A$2:$B$92,2,FALSE)","v":{"$error":"#N/A"}},{"$f":"VLOOKUP(B304,Players!A$2:$B$92,2,FALSE)","v":{"$error":"#N/A"}}]
[null,null,1,null,36,{"$f":"IF(C305=1,VLOOKUP(E305,Pivots!$AX$3:$BA$45,2))/2+IF(C305=2,VLOOKUP(E305,Pivots!$AX$3:$BA$45,3))/2+IF(C305=3,VLOOKUP(E305,Pivots!$AX$3:$BA$45,4))/2","v":0},"",{"$f":"VLOOKUP(A305,Players!$A$2:$B$92,2,FALSE)","v":{"$error":"#N/A"}},{"$f":"VLOOKUP(B305,Players!A$2:$B$92,2,FALSE)","v":{"$error":"#N/A"}}]
[null,null,2,null,36,{"$f":"IF(C306=1,VLOOKUP(E306,Pivots!$AX$3:$BA$45,2))/2+IF(C306=2,VLOOKUP(E306,Pivots!$AX$3:$BA$45,3))/2+IF(C306=3,VLOOKUP(E306,Pivots!$AX$3:$BA$45,4))/2","v":0},"",{"$f":"VLOOKUP(A306,Players!$A$2:$B$92,2,FALSE)","v":{"$error":"#N/A"}},{"$f":"VLOOKUP(B306,Players!A$2:$B$92,2,FALSE)","v":{"$error":"#N/A"}}]
[null,null,2,null,36,{"$f":"IF(C307=1,VLOOKUP(E307,Pivots!$AX$3:$BA$45,2))/2+IF(C307=2,VLOOKUP(E307,Pivots!$AX$3:$BA$45,3))/2+IF(C307=3,VLOOKUP(E307,Pivots!$AX$3:$BA$45,4))/2","v":0},"",{"$f":"VLOOKUP(A307,Players!$A$2:$B$92,2,FALSE)","v":{"$error":"#N/A"}},{"$f":"VLOOKUP(B307,Players!A$2:$B$92,2,FALSE)","v":{"$error":"#N/A"}}]
[null,null,2,null,36,{"$f":"IF(C308=1,VLOOKUP(E308,Pivots!$AX$3:$BA$45,2))/2+IF(C308=2,VLOOKUP(E308,Pivots!$AX$3:$BA$45,3))/2+IF(C308=3,VLOOKUP(E308,Pivots!$AX$3:$BA$45,4))/2","v":0},"",{"$f":"VLOOKUP(A308,Players!$A$2:$B$92,2,FALSE)","v":{"$error":"#N/A"}},{"$f":"VLOOKUP(B308,Players!A$2:$B$92,2,FALSE)","v":{"$error":"#N/A"}}]
[null,null,2,null,36,{"$f":"IF(C309=1,VLOOKUP(E309,Pivots!$AX$3:$BA$45,2))/2+IF(C309=2,VLOOKUP(E309,Pivots!$AX$3:$BA$45,3))/2+IF(C309=3,VLOOKUP(E309,Pivots!$AX$3:$BA$45,4))/2","v":0},"",{"$f":"VLOOKUP(A309,Players!$A$2:$B$92,2,FALSE)","v":{"$error":"#N/A"}},{"$f":"VLOOKUP(B309,Players!A$2:$B$92,2,FALSE)","v":{"$error":"#N/A"}}]
[null,null,3,null,36,{"$f":"IF(C310=1,VLOOKUP(E310,Pivots!$AX$3:$BA$45,2))/2+IF(C310=2,VLOOKUP(E310,Pivots!$AX$3:$BA$45,3))/2+IF(C310=3,VLOOKUP(E310,Pivots!$AX$3:$BA$45,4))/2","v":0},"",{"$f":"VLOOKUP(A310,Players!$A$2:$B$92,2,FALSE)","v":{"$error":"#N/A"}},{"$f":"VLOOKUP(B310,Players!A$2:$B$92,2,FALSE)","v":{"$error":"#N/A"}}]
[null,null,3,null,36,{"$f":"IF(C311=1,VLOOKUP(E311,Pivots!$AX$3:$BA$45,2))/2+IF(C311=2,VLOOKUP(E311,Pivots!$AX$3:$BA$45,3))/2+IF(C311=3,VLOOKUP(E311,Pivots!$AX$3:$BA$45,4))/2","v":0},"",{"$f":"VLOOKUP(A311,Players!$A$2:$B$92,2,FALSE)","v":{"$error":"#N/A"}},{"$f":"VLOOKUP(B311,Players!A$2:$B$92,2,FALSE)","v":{"$error":"#N/A"}}]
[null,null,3,null,36,{"$f":"IF(C312=1,VLOOKUP(E312,Pivots!$AX$3:$BA$45,2))/2+IF(C312=2,VLOOKUP(E312,Pivots!$AX$3:$BA$45,3))/2+IF(C312=3,VLOOKUP(E312,Pivots!$AX$3:$BA$45,4))/2","v":0},"",{"$f":"VLOOKUP(A312,Players!$A$2:$B$92,2,FALSE)","v":{"$error":"#N/A"}},{"$f":"VLOOKUP(B312,Players!A$2:$B$92,2,FALSE)","v":{"$error":"#N/A"}}]
[null,null,3,null,36,{"$f":"IF(C313=1,VLOOKUP(E313,Pivots!$AX$3:$BA$45,2))/2+IF(C313=2,VLOOKUP(E313,Pivots!$AX$3:$BA$45,3))/2+IF(C313=3,VLOOKUP(E313,Pivots!$AX$3:$BA$45,4))/2","v":0},"",{"$f":"VLOOKUP(A313,Players!$A$2:$B$92,2,FALSE)","v":{"$error":"#N/A"}},{"$f":"VLOOKUP(B313,Players!A$2:$B$92,2,FALSE)","v":{"$error":"#N/A"}}]
[null,null,1,null,{"$f":"E302+1","v":37},{"$f":"IF(C314=1,VLOOKUP(E314,Pivots!$AX$3:$BA$45,2))/2+IF(C314=2,VLOOKUP(E314,Pivots!$AX$3:$BA$45,3))/2+IF(C314=3,VLOOKUP(E314,Pivots!$AX$3:$BA$45,4))/2","v":0},"",{"$f":"VLOOKUP(A314,Players!$A$2:$B$92,2,FALSE)","v":{"$error":"#N/A"}},{"$f":"VLOOKUP(B314,Players!A$2:$B$92,2,FALSE)","v":{"$error":"#N/A"}}]
[null,null,1,null,{"$f":"E314","v":37},{"$f":"IF(C315=1,VLOOKUP(E315,Pivots!$AX$3:$BA$45,2))/2+IF(C315=2,VLOOKUP(E315,Pivots!$AX$3:$BA$45,3))/2+IF(C315=3,VLOOKUP(E315,Pivots!$AX$3:$BA$45,4))/2","v":0},"",{"$f":"VLOOKUP(A315,Players!$A$2:$B$92,2,FALSE)","v":{"$error":"#N/A"}},{"$f":"VLOOKUP(B315,Players!A$2:$B$92,2,FALSE)","v":{"$error":"#N/A"}}]
[null,null,1,null,{"$f":"E315","v":37},{"$f":"IF(C316=1,VLOOKUP(E316,Pivots!$AX$3:$BA$45,2))/2+IF(C316=2,VLOOKUP(E316,Pivots!$AX$3:$BA$45,3))/2+IF(C316=3,VLOOKUP(E316,Pivots!$AX$3:$BA$45,4))/2","v":0},"",{"$f":"VLOOKUP(A316,Players!$A$2:$B$92,2,FALSE)","v":{"$error":"#N/A"}},{"$f":"VLOOKUP(B316,Players!A$2:$B$92,2,FALSE)","v":{"$error":"#N/A"}}]
[null,null,1,null,37,{"$f":"IF(C317=1,VLOOKUP(E317,Pivots!$AX$3:$BA$45,2))/2+IF(C317=2,VLOOKUP(E317,Pivots!$AX$3:$BA$45,3))/2+IF(C317=3,VLOOKUP(E317,Pivots!$AX$3:$BA$45,4))/2","v":0},"",{"$f":"VLOOKUP(A317,Players!$A$2:$B$92,2,FALSE)","v":{"$error":"#N/A"}},{"$f":"VLOOKUP(B317,Players!A$2:$B$92,2,FALSE)","v":{"$error":"#N/A"}}]
[null,null,2,null,37,{"$f":"IF(C318=1,VLOOKUP(E318,Pivots!$AX$3:$BA$45,2))/2+IF(C318=2,VLOOKUP(E318,Pivots!$AX$3:$BA$45,3))/2+IF(C318=3,VLOOKUP(E318,Pivots!$AX$3:$BA$45,4))/2","v":0},"",{"$f":"VLOOKUP(A318,Players!$A$2:$B$92,2,FALSE)","v":{"$error":"#N/A"}},{"$f":"VLOOKUP(B318,Players!A$2:$B$92,2,FALSE)","v":{"$error":"#N/A"}}]
[null,null,2,null,37,{"$f":"IF(C319=1,VLOOKUP(E319,Pivots!$AX$3:$BA$45,2))/2+IF(C319=2,VLOOKUP(E319,Pivots!$AX$3:$BA$45,3))/2+IF(C319=3,VLOOKUP(E319,Pivots!$AX$3:$BA$45,4))/2","v":0},"",{"$f":"VLOOKUP(A319,Players!$A$2:$B$92,2,FALSE)","v":{"$error":"#N/A"}},{"$f":"VLOOKUP(B319,Players!A$2:$B$92,2,FALSE)","v":{"$error":"#N/A"}}]
[null,null,2,null,37,{"$f":"IF(C320=1,VLOOKUP(E320,Pivots!$AX$3:$BA$45,2))/2+IF(C320=2,VLOOKUP(E320,Pivots!$AX$3:$BA$45,3))/2+IF(C320=3,VLOOKUP(E320,Pivots!$AX$3:$BA$45,4))/2","v":0},"",{"$f":"VLOOKUP(A320,Players!$A$2:$B$92,2,FALSE)","v":{"$error":"#N/A"}},{"$f":"VLOOKUP(B320,Players!A$2:$B$92,2,FALSE)","v":{"$error":"#N/A"}}]
[null,null,2,null,37,{"$f":"IF(C321=1,VLOOKUP(E321,Pivots!$AX$3:$BA$45,2))/2+IF(C321=2,VLOOKUP(E321,Pivots!$AX$3:$BA$45,3))/2+IF(C321=3,VLOOKUP(E321,Pivots!$AX$3:$BA$45,4))/2","v":0},"",{"$f":"VLOOKUP(A321,Players!$A$2:$B$92,2,FALSE)","v":{"$error":"#N/A"}},{"$f":"VLOOKUP(B321,Players!A$2:$B$92,2,FALSE)","v":{"$error":"#N/A"}}]
[null,null,3,null,37,{"$f":"IF(C322=1,VLOOKUP(E322,Pivots!$AX$3:$BA$45,2))/2+IF(C322=2,VLOOKUP(E322,Pivots!$AX$3:$BA$45,3))/2+IF(C322=3,VLOOKUP(E322,Pivots!$AX$3:$BA$45,4))/2","v":0},{"$f":"IF(A322=\"\",\"\",D322-F322/4)","v":""},{"$f":"VLOOKUP(A322,Players!$A$2:$B$92,2,FALSE)","v":{"$error":"#N/A"}},{"$f":"VLOOKUP(B322,Players!A$2:$B$92,2,FALSE)","v":{"$error":"#N/A"}}]
[null,null,3,null,37,{"$f":"IF(C323=1,VLOOKUP(E323,Pivots!$AX$3:$BA$45,2))/2+IF(C323=2,VLOOKUP(E323,Pivots!$AX$3:$BA$45,3))/2+IF(C323=3,VLOOKUP(E323,Pivots!$AX$3:$BA$45,4))/2","v":0},"",{"$f":"VLOOKUP(A323,Players!$A$2:$B$92,2,FALSE)","v":{"$error":"#N/A"}},{"$f":"VLOOKUP(B323,Players!A$2:$B$92,2,FALSE)","v":{"$error":"#N/A"}}]
[null,null,3,null,37,{"$f":"IF(C324=1,VLOOKUP(E324,Pivots!$AX$3:$BA$45,2))/2+IF(C324=2,VLOOKUP(E324,Pivots!$AX$3:$BA$45,3))/2+IF(C324=3,VLOOKUP(E324,Pivots!$AX$3:$BA$45,4))/2","v":0},"",{"$f":"VLOOKUP(A324,Players!$A$2:$B$92,2,FALSE)","v":{"$error":"#N/A"}},{"$f":"VLOOKUP(B324,Players!A$2:$B$92,2,FALSE)","v":{"$error":"#N/A"}}]
[null,null,3,null,37,{"$f":"IF(C325=1,VLOOKUP(E325,Pivots!$AX$3:$BA$45,2))/2+IF(C325=2,VLOOKUP(E325,Pivots!$AX$3:$BA$45,3))/2+IF(C325=3,VLOOKUP(E325,Pivots!$AX$3:$BA$45,4))/2","v":0},"",{"$f":"VLOOKUP(A325,Players!$A$2:$B$92,2,FALSE)","v":{"$error":"#N/A"}},{"$f":"VLOOKUP(B325,Players!A$2:$B$92,2,FALSE)","v":{"$error":"#N/A"}}]
[null,null,1,null,{"$f":"E314+1","v":38},{"$f":"IF(C326=1,VLOOKUP(E326,Pivots!$AX$3:$BA$45,2))/2+IF(C326=2,VLOOKUP(E326,Pivots!$AX$3:$BA$45,3))/2+IF(C326=3,VLOOKUP(E326,Pivots!$AX$3:$BA$45,4))/2","v":0},"",{"$f":"VLOOKUP(A326,Players!$A$2:$B$92,2,FALSE)","v":{"$error":"#N/A"}},{"$f":"VLOOKUP(B326,Players!A$2:$B$92,2,FALSE)","v":{"$error":"#N/A"}}]
[null,null,1,null,{"$f":"E326","v":38},{"$f":"IF(C327=1,VLOOKUP(E327,Pivots!$AX$3:$BA$45,2))/2+IF(C327=2,VLOOKUP(E327,Pivots!$AX$3:$BA$45,3))/2+IF(C327=3,VLOOKUP(E327,Pivots!$AX$3:$BA$45,4))/2","v":0},"",{"$f":"VLOOKUP(A327,Players!$A$2:$B$92,2,FALSE)","v":{"$error":"#N/A"}},{"$f":"VLOOKUP(B327,Players!A$2:$B$92,2,FALSE)","v":{"$error":"#N/A"}}]
[null,null,1,null,{"$f":"E327","v":38},{"$f":"IF(C328=1,VLOOKUP(E328,Pivots!$AX$3:$BA$45,2))/2+IF(C328=2,VLOOKUP(E328,Pivots!$AX$3:$BA$45,3))/2+IF(C328=3,VLOOKUP(E328,Pivots!$AX$3:$BA$45,4))/2","v":0},"",{"$f":"VLOOKUP(A328,Players!$A$2:$B$92,2,FALSE)","v":{"$error":"#N/A"}},{"$f":"VLOOKUP(B328,Players!A$2:$B$92,2,FALSE)","v":{"$error":"#N/A"}}]
[null,null,1,null,38,{"$f":"IF(C329=1,VLOOKUP(E329,Pivots!$AX$3:$BA$45,2))/2+IF(C329=2,VLOOKUP(E329,Pivots!$AX$3:$BA$45,3))/2+IF(C329=3,VLOOKUP(E329,Pivots!$AX$3:$BA$45,4))/2","v":0},"",{"$f":"VLOOKUP(A329,Players!$A$2:$B$92,2,FALSE)","v":{"$error":"#N/A"}},{"$f":"VLOOKUP(B329,Players!A$2:$B$92,2,FALSE)","v":{"$error":"#N/A"}}]
[null,null,2,null,38,{"$f":"IF(C330=1,VLOOKUP(E330,Pivots!$AX$3:$BA$45,2))/2+IF(C330=2,VLOOKUP(E330,Pivots!$AX$3:$BA$45,3))/2+IF(C330=3,VLOOKUP(E330,Pivots!$AX$3:$BA$45,4))/2","v":0},"",{"$f":"VLOOKUP(A330,Players!$A$2:$B$92,2,FALSE)","v":{"$error":"#N/A"}},{"$f":"VLOOKUP(B330,Players!A$2:$B$92,2,FALSE)","v":{"$error":"#N/A"}}]
[null,null,2,null,38,{"$f":"IF(C331=1,VLOOKUP(E331,Pivots!$AX$3:$BA$45,2))/2+IF(C331=2,VLOOKUP(E331,Pivots!$AX$3:$BA$45,3))/2+IF(C331=3,VLOOKUP(E331,Pivots!$AX$3:$BA$45,4))/2","v":0},"",{"$f":"VLOOKUP(A331,Players!$A$2:$B$92,2,FALSE)","v":{"$error":"#N/A"}},{"$f":"VLOOKUP(B331,Players!A$2:$B$92,2,FALSE)","v":{"$error":"#N/A"}}]
[null,null,2,null,38,{"$f":"IF(C332=1,VLOOKUP(E332,Pivots!$AX$3:$BA$45,2))/2+IF(C332=2,VLOOKUP(E332,Pivots!$AX$3:$BA$45,3))/2+IF(C332=3,VLOOKUP(E332,Pivots!$AX$3:$BA$45,4))/2","v":0},"",{"$f":"VLOOKUP(A332,Players!$A$2:$B$92,2,FALSE)","v":{"$error":"#N/A"}},{"$f":"VLOOKUP(B332,Players!A$2:$B$92,2,FALSE)","v":{"$error":"#N/A"}}]
[null,null,2,null,38,{"$f":"IF(C333=1,VLOOKUP(E333,Pivots!$AX$3:$BA$45,2))/2+IF(C333=2,VLOOKUP(E333,Pivots!$AX$3:$BA$45,3))/2+IF(C333=3,VLOOKUP(E333,Pivots!$AX$3:$BA$45,4))/2","v":0},"",{"$f":"VLOOKUP(A333,Players!$A$2:$B$92,2,FALSE)","v":{"$error":"#N/A"}},{"$f":"VLOOKUP(B333,Players!A$2:$B$92,2,FALSE)","v":{"$error":"#N/A"}}]
[null,null,3,null,38,{"$f":"IF(C334=1,VLOOKUP(E334,Pivots!$AX$3:$BA$45,2))/2+IF(C334=2,VLOOKUP(E334,Pivots!$AX$3:$BA$45,3))/2+IF(C334=3,VLOOKUP(E334,Pivots!$AX$3:$BA$45,4))/2","v":0},"",{"$f":"VLOOKUP(A334,Players!$A$2:$B$92,2,FALSE)","v":{"$error":"#N/A"}},{"$f":"VLOOKUP(B334,Players!A$2:$B$92,2,FALSE)","v":{"$error":"#N/A"}}]
[null,null,3,null,38,{"$f":"IF(C335=1,VLOOKUP(E335,Pivots!$AX$3:$BA$45,2))/2+IF(C335=2,VLOOKUP(E335,Pivots!$AX$3:$BA$45,3))/2+IF(C335=3,VLOOKUP(E335,Pivots!$AX$3:$BA$45,4))/2","v":0},"",{"$f":"VLOOKUP(A335,Players!$A$2:$B$92,2,FALSE)","v":{"$error":"#N/A"}},{"$f":"VLOOKUP(B335,Players!A$2:$B$92,2,FALSE)","v":{"$error":"#N/A"}}]
[null,null,3,null,38,{"$f":"IF(C336=1,VLOOKUP(E336,Pivots!$AX$3:$BA$45,2))/2+IF(C336=2,VLOOKUP(E336,Pivots!$AX$3:$BA$45,3))/2+IF(C336=3,VLOOKUP(E336,Pivots!$AX$3:$BA$45,4))/2","v":0},"",{"$f":"VLOOKUP(A336,Players!$A$2:$B$92,2,FALSE)","v":{"$error":"#N/A"}},{"$f":"VLOOKUP(B336,Players!A$2:$B$92,2,FALSE)","v":{"$error":"#N/A"}}]
[null,null,3,null,38,{"$f":"IF(C337=1,VLOOKUP(E337,Pivots!$AX$3:$BA$45,2))/2+IF(C337=2,VLOOKUP(E337,Pivots!$AX$3:$BA$45,3))/2+IF(C337=3,VLOOKUP(E337,Pivots!$AX$3:$BA$45,4))/2","v":0},"",{"$f":"VLOOKUP(A337,Players!$A$2:$B$92,2,FALSE)","v":{"$error":"#N/A"}},{"$f":"VLOOKUP(B337,Players!A$2:$B$92,2,FALSE)","v":{"$error":"#N/A"}}]
[null,null,1,null,{"$f":"E326+1","v":39},{"$f":"IF(C338=1,VLOOKUP(E338,Pivots!$AX$3:$BA$45,2))/2+IF(C338=2,VLOOKUP(E338,Pivots!$AX$3:$BA$45,3))/2+IF(C338=3,VLOOKUP(E338,Pivots!$AX$3:$BA$45,4))/2","v":0},"",{"$f":"VLOOKUP(A338,Players!$A$2:$B$92,2,FALSE)","v":{"$error":"#N/A"}},{"$f":"VLOOKUP(B338,Players!A$2:$B$92,2,FALSE)","v":{"$error":"#N/A"}}]
[null,null,1,null,{"$f":"E338","v":39},{"$f":"IF(C339=1,VLOOKUP(E339,Pivots!$AX$3:$BA$45,2))/2+IF(C339=2,VLOOKUP(E339,Pivots!$AX$3:$BA$45,3))/2+IF(C339=3,VLOOKUP(E339,Pivots!$AX$3:$BA$45,4))/2","v":0},"",{"$f":"VLOOKUP(A339,Players!$A$2:$B$92,2,FALSE)","v":{"$error":"#N/A"}},{"$f":"VLOOKUP(B339,Players!A$2:$B$92,2,FALSE)","v":{"$error":"#N/A"}}]
[null,null,1,null,{"$f":"E339","v":39},{"$f":"IF(C340=1,VLOOKUP(E340,Pivots!$AX$3:$BA$45,2))/2+IF(C340=2,VLOOKUP(E340,Pivots!$AX$3:$BA$45,3))/2+IF(C340=3,VLOOKUP(E340,Pivots!$AX$3:$BA$45,4))/2","v":0},"",{"$f":"VLOOKUP(A340,Players!$A$2:$B$92,2,FALSE)","v":{"$error":"#N/A"}},{"$f":"VLOOKUP(B340,Players!A$2:$B$92,2,FALSE)","v":{"$error":"#N/A"}}]
[null,null,1,null,39,{"$f":"IF(C341=1,VLOOKUP(E341,Pivots!$AX$3:$BA$45,2))/2+IF(C341=2,VLOOKUP(E341,Pivots!$AX$3:$BA$45,3))/2+IF(C341=3,VLOOKUP(E341,Pivots!$AX$3:$BA$45,4))/2","v":0},"",{"$f":"VLOOKUP(A341,Players!$A$2:$B$92,2,FALSE)","v":{"$error":"#N/A"}},{"$f":"VLOOKUP(B341,Players!A$2:$B$92,2,FALSE)","v":{"$error":"#N/A"}}]
[null,null,2,null,39,{"$f":"IF(C342=1,VLOOKUP(E342,Pivots!$AX$3:$BA$45,2))/2+IF(C342=2,VLOOKUP(E342,Pivots!$AX$3:$BA$45,3))/2+IF(C342=3,VLOOKUP(E342,Pivots!$AX$3:$BA$45,4))/2","v":0},"",{"$f":"VLOOKUP(A342,Players!$A$2:$B$92,2,FALSE)","v":{"$error":"#N/A"}},{"$f":"VLOOKUP(B342,Players!A$2:$B$92,2,FALSE)","v":{"$error":"#N/A"}}]
[null,null,2,null,39,{"$f":"IF(C343=1,VLOOKUP(E343,Pivots!$AX$3:$BA$45,2))/2+IF(C343=2,VLOOKUP(E343,Pivots!$AX$3:$BA$45,3))/2+IF(C343=3,VLOOKUP(E343,Pivots!$AX$3:$BA$45,4))/2","v":0},"",{"$f":"VLOOKUP(A343,Players!$A$2:$B$92,2,FALSE)","v":{"$error":"#N/A"}},{"$f":"VLOOKUP(B343,Players!A$2:$B$92,2,FALSE)","v":{"$error":"#N/A"}}]
[null,null,2,null,39,{"$f":"IF(C344=1,VLOOKUP(E344,Pivots!$AX$3:$BA$45,2))/2+IF(C344=2,VLOOKUP(E344,Pivots!$AX$3:$BA$45,3))/2+IF(C344=3,VLOOKUP(E344,Pivots!$AX$3:$BA$45,4))/2","v":0},"",{"$f":"VLOOKUP(A344,Players!$A$2:$B$92,2,FALSE)","v":{"$error":"#N/A"}},{"$f":"VLOOKUP(B344,Players!A$2:$B$92,2,FALSE)","v":{"$error":"#N/A"}}]
[null,null,2,null,39,{"$f":"IF(C345=1,VLOOKUP(E345,Pivots!$AX$3:$BA$45,2))/2+IF(C345=2,VLOOKUP(E345,Pivots!$AX$3:$BA$45,3))/2+IF(C345=3,VLOOKUP(E345,Pivots!$AX$3:$BA$45,4))/2","v":0},"",{"$f":"VLOOKUP(A345,Players!$A$2:$B$92,2,FALSE)","v":{"$error":"#N/A"}},{"$f":"VLOOKUP(B345,Players!A$2:$B$92,2,FALSE)","v":{"$error":"#N/A"}}]
[null,null,3,null,39,{"$f":"IF(C346=1,VLOOKUP(E346,Pivots!$AX$3:$BA$45,2))/2+IF(C346=2,VLOOKUP(E346,Pivots!$AX$3:$BA$45,3))/2+IF(C346=3,VLOOKUP(E346,Pivots!$AX$3:$BA$45,4))/2","v":0},"",{"$f":"VLOOKUP(A346,Players!$A$2:$B$92,2,FALSE)","v":{"$error":"#N/A"}},{"$f":"VLOOKUP(B346,Players!A$2:$B$92,2,FALSE)","v":{"$error":"#N/A"}}]
[null,null,3,null,39,{"$f":"IF(C347=1,VLOOKUP(E347,Pivots!$AX$3:$BA$45,2))/2+IF(C347=2,VLOOKUP(E347,Pivots!$AX$3:$BA$45,3))/2+IF(C347=3,VLOOKUP(E347,Pivots!$AX$3:$BA$45,4))/2","v":0},"",{"$f":"VLOOKUP(A347,Players!$A$2:$B$92,2,FALSE)","v":{"$error":"#N/A"}},{"$f":"VLOOKUP(B347,Players!A$2:$B$92,2,FALSE)","v":{"$error":"#N/A"}}]
[null,null,3,null,39,{"$f":"IF(C348=1,VLOOKUP(E348,Pivots!$AX$3:$BA$45,2))/2+IF(C348=2,VLOOKUP(E348,Pivots!$AX$3:$BA$45,3))/2+IF(C348=3,VLOOKUP(E348,Pivots!$AX$3:$BA$45,4))/2","v":0},"",{"$f":"VLOOKUP(A348,Players!$A$2:$B$92,2,FALSE)","v":{"$error":"#N/A"}},{"$f":"VLOOKUP(B348,Players!A$2:$B$92,2,FALSE)","v":{"$error":"#N/A"}}]
[null,null,3,null,39,{"$f":"IF(C349=1,VLOOKUP(E349,Pivots!$AX$3:$BA$45,2))/2+IF(C349=2,VLOOKUP(E349,Pivots!$AX$3:$BA$45,3))/2+IF(C349=3,VLOOKUP(E349,Pivots!$AX$3:$BA$45,4))/2","v":0},"",{"$f":"VLOOKUP(A349,Players!$A$2:$B$92,2,FALSE)","v":{"$error":"#N/A"}},{"$f":"VLOOKUP(B349,Players!A$2:$B$92,2,FALSE)","v":{"$error":"#N/A"}}]
[null,null,1,null,{"$f":"E338+1","v":40},{"$f":"IF(C350=1,VLOOKUP(E350,Pivots!$AX$3:$BA$45,2))/2+IF(C350=2,VLOOKUP(E350,Pivots!$AX$3:$BA$45,3))/2+IF(C350=3,VLOOKUP(E350,Pivots!$AX$3:$BA$45,4))/2","v":0},"",{"$f":"VLOOKUP(A350,Players!$A$2:$B$92,2,FALSE)","v":{"$error":"#N/A"}},{"$f":"VLOOKUP(B350,Players!A$2:$B$92,2,FALSE)","v":{"$error":"#N/A"}}]
[null,null,1,null,{"$f":"E350","v":40},{"$f":"IF(C351=1,VLOOKUP(E351,Pivots!$AX$3:$BA$45,2))/2+IF(C351=2,VLOOKUP(E351,Pivots!$AX$3:$BA$45,3))/2+IF(C351=3,VLOOKUP(E351,Pivots!$AX$3:$BA$45,4))/2","v":0},"",{"$f":"VLOOKUP(A351,Players!$A$2:$B$92,2,FALSE)","v":{"$error":"#N/A"}},{"$f":"VLOOKUP(B351,Players!A$2:$B$92,2,FALSE)","v":{"$error":"#N/A"}}]
[null,null,1,null,{"$f":"E351","v":40},{"$f":"IF(C352=1,VLOOKUP(E352,Pivots!$AX$3:$BA$45,2))/2+IF(C352=2,VLOOKUP(E352,Pivots!$AX$3:$BA$45,3))/2+IF(C352=3,VLOOKUP(E352,Pivots!$AX$3:$BA$45,4))/2","v":0},"",{"$f":"VLOOKUP(A352,Players!$A$2:$B$92,2,FALSE)","v":{"$error":"#N/A"}},{"$f":"VLOOKUP(B352,Players!A$2:$B$92,2,FALSE)","v":{"$error":"#N/A"}}]
[null,null,1,null,40,{"$f":"IF(C353=1,VLOOKUP(E353,Pivots!$AX$3:$BA$45,2))/2+IF(C353=2,VLOOKUP(E353,Pivots!$AX$3:$BA$45,3))/2+IF(C353=3,VLOOKUP(E353,Pivots!$AX$3:$BA$45,4))/2","v":0},"",{"$f":"VLOOKUP(A353,Players!$A$2:$B$92,2,FALSE)","v":{"$error":"#N/A"}},{"$f":"VLOOKUP(B353,Players!A$2:$B$92,2,FALSE)","v":{"$error":"#N/A"}}]
[null,null,2,null,40,{"$f":"IF(C354=1,VLOOKUP(E354,Pivots!$AX$3:$BA$45,2))/2+IF(C354=2,VLOOKUP(E354,Pivots!$AX$3:$BA$45,3))/2+IF(C354=3,VLOOKUP(E354,Pivots!$AX$3:$BA$45,4))/2","v":0},"",{"$f":"VLOOKUP(A354,Players!$A$2:$B$92,2,FALSE)","v":{"$error":"#N/A"}},{"$f":"VLOOKUP(B354,Players!A$2:$B$92,2,FALSE)","v":{"$error":"#N/A"}}]
[null,null,2,null,40,{"$f":"IF(C355=1,VLOOKUP(E355,Pivots!$AX$3:$BA$45,2))/2+IF(C355=2,VLOOKUP(E355,Pivots!$AX$3:$BA$45,3))/2+IF(C355=3,VLOOKUP(E355,Pivots!$AX$3:$BA$45,4))/2","v":0},"",{"$f":"VLOOKUP(A355,Players!$A$2:$B$92,2,FALSE)","v":{"$error":"#N/A"}},{"$f":"VLOOKUP(B355,Players!A$2:$B$92,2,FALSE)","v":{"$error":"#N/A"}}]
[null,null,2,null,40,{"$f":"IF(C356=1,VLOOKUP(E356,Pivots!$AX$3:$BA$45,2))/2+IF(C356=2,VLOOKUP(E356,Pivots!$AX$3:$BA$45,3))/2+IF(C356=3,VLOOKUP(E356,Pivots!$AX$3:$BA$45,4))/2","v":0},"",{"$f":"VLOOKUP(A356,Players!$A$2:$B$92,2,FALSE)","v":{"$error":"#N/A"}},{"$f":"VLOOKUP(B356,Players!A$2:$B$92,2,FALSE)","v":{"$error":"#N/A"}}]
[null,null,2,null,40,{"$f":"IF(C357=1,VLOOKUP(E357,Pivots!$AX$3:$BA$45,2))/2+IF(C357=2,VLOOKUP(E357,Pivots!$AX$3:$BA$45,3))/2+IF(C357=3,VLOOKUP(E357,Pivots!$AX$3:$BA$45,4))/2","v":0},"",{"$f":"VLOOKUP(A357,Players!$A$2:$B$92,2,FALSE)","v":{"$error":"#N/A"}},{"$f":"VLOOKUP(B357,Players!A$2:$B$92,2,FALSE)","v":{"$error":"#N/A"}}]
[null,null,3,null,40,{"$f":"IF(C358=1,VLOOKUP(E358,Pivots!$AX$3:$BA$45,2))/2+IF(C358=2,VLOOKUP(E358,Pivots!$AX$3:$BA$45,3))/2+IF(C358=3,VLOOKUP(E358,Pivots!$AX$3:$BA$45,4))/2","v":0},"",{"$f":"VLOOKUP(A358,Players!$A$2:$B$92,2,FALSE)","v":{"$error":"#N/A"}},{"$f":"VLOOKUP(B358,Players!A$2:$B$92,2,FALSE)","v":{"$error":"#N/A"}}]
[null,null,3,null,40,{"$f":"IF(C359=1,VLOOKUP(E359,Pivots!$AX$3:$BA$45,2))/2+IF(C359=2,VLOOKUP(E359,Pivots!$AX$3:$BA$45,3))/2+IF(C359=3,VLOOKUP(E359,Pivots!$AX$3:$BA$45,4))/2","v":0},"",{"$f":"VLOOKUP(A359,Players!$A$2:$B$92,2,FALSE)","v":{"$error":"#N/A"}},{"$f":"VLOOKUP(B359,Players!A$2:$B$92,2,FALSE)","v":{"$error":"#N/A"}}]
[null,null,3,null,40,{"$f":"IF(C360=1,VLOOKUP(E360,Pivots!$AX$3:$BA$45,2))/2+IF(C360=2,VLOOKUP(E360,Pivots!$AX$3:$BA$45,3))/2+IF(C360=3,VLOOKUP(E360,Pivots!$AX$3:$BA$45,4))/2","v":0},"",{"$f":"VLOOKUP(A360,Players!$A$2:$B$92,2,FALSE)","v":{"$error":"#N/A"}},{"$f":"VLOOKUP(B360,Players!A$2:$B$92,2,FALSE)","v":{"$error":"#N/A"}}]
[null,null,3,null,40,{"$f":"IF(C361=1,VLOOKUP(E361,Pivots!$AX$3:$BA$45,2))/2+IF(C361=2,VLOOKUP(E361,Pivots!$AX$3:$BA$45,3))/2+IF(C361=3,VLOOKUP(E361,Pivots!$AX$3:$BA$45,4))/2","v":0},"",{"$f":"VLOOKUP(A361,Players!$A$2:$B$92,2,FALSE)","v":{"$error":"#N/A"}},{"$f":"VLOOKUP(B361,Players!A$2:$B$92,2,FALSE)","v":{"$error":"#N/A"}}]
[null,null,1,null,{"$f":"E350+1","v":41},{"$f":"IF(C362=1,VLOOKUP(E362,Pivots!$AX$3:$BA$45,2))/2+IF(C362=2,VLOOKUP(E362,Pivots!$AX$3:$BA$45,3))/2+IF(C362=3,VLOOKUP(E362,Pivots!$AX$3:$BA$45,4))/2","v":0},"",{"$f":"VLOOKUP(A362,Players!$A$2:$B$92,2,FALSE)","v":{"$error":"#N/A"}},{"$f":"VLOOKUP(B362,Players!A$2:$B$92,2,FALSE)","v":{"$error":"#N/A"}}]
[null,null,1,null,{"$f":"E362","v":41},{"$f":"IF(C363=1,VLOOKUP(E363,Pivots!$AX$3:$BA$45,2))/2+IF(C363=2,VLOOKUP(E363,Pivots!$AX$3:$BA$45,3))/2+IF(C363=3,VLOOKUP(E363,Pivots!$AX$3:$BA$45,4))/2","v":0},"",{"$f":"VLOOKUP(A363,Players!$A$2:$B$92,2,FALSE)","v":{"$error":"#N/A"}},{"$f":"VLOOKUP(B363,Players!A$2:$B$92,2,FALSE)","v":{"$error":"#N/A"}}]
[null,null,1,null,{"$f":"E363","v":41},{"$f":"IF(C364=1,VLOOKUP(E364,Pivots!$AX$3:$BA$45,2))/2+IF(C364=2,VLOOKUP(E364,Pivots!$AX$3:$BA$45,3))/2+IF(C364=3,VLOOKUP(E364,Pivots!$AX$3:$BA$45,4))/2","v":0},"",{"$f":"VLOOKUP(A364,Players!$A$2:$B$92,2,FALSE)","v":{"$error":"#N/A"}},{"$f":"VLOOKUP(B364,Players!A$2:$B$92,2,FALSE)","v":{"$error":"#N/A"}}]
[null,null,1,null,41,{"$f":"IF(C365=1,VLOOKUP(E365,Pivots!$AX$3:$BA$45,2))/2+IF(C365=2,VLOOKUP(E365,Pivots!$AX$3:$BA$45,3))/2+IF(C365=3,VLOOKUP(E365,Pivots!$AX$3:$BA$45,4))/2","v":0},"",{"$f":"VLOOKUP(A365,Players!$A$2:$B$92,2,FALSE)","v":{"$error":"#N/A"}},{"$f":"VLOOKUP(B365,Players!A$2:$B$92,2,FALSE)","v":{"$error":"#N/A"}}]
[null,null,2,null,41,{"$f":"IF(C366=1,VLOOKUP(E366,Pivots!$AX$3:$BA$45,2))/2+IF(C366=2,VLOOKUP(E366,Pivots!$AX$3:$BA$45,3))/2+IF(C366=3,VLOOKUP(E366,Pivots!$AX$3:$BA$45,4))/2","v":0},"",{"$f":"VLOOKUP(A366,Players!$A$2:$B$92,2,FALSE)","v":{"$error":"#N/A"}},{"$f":"VLOOKUP(B366,Players!A$2:$B$92,2,FALSE)","v":{"$error":"#N/A"}}]
[null,null,2,null,41,{"$f":"IF(C367=1,VLOOKUP(E367,Pivots!$AX$3:$BA$45,2))/2+IF(C367=2,VLOOKUP(E367,Pivots!$AX$3:$BA$45,3))/2+IF(C367=3,VLOOKUP(E367,Pivots!$AX$3:$BA$45,4))/2","v":0},"",{"$f":"VLOOKUP(A367,Players!$A$2:$B$92,2,FALSE)","v":{"$error":"#N/A"}},{"$f":"VLOOKUP(B367,Players!A$2:$B$92,2,FALSE)","v":{"$error":"#N/A"}}]
[null,null,2,null,41,{"$f":"IF(C368=1,VLOOKUP(E368,Pivots!$AX$3:$BA$45,2))/2+IF(C368=2,VLOOKUP(E368,Pivots!$AX$3:$BA$45,3))/2+IF(C368=3,VLOOKUP(E368,Pivots!$AX$3:$BA$45,4))/2","v":0},"",{"$f":"VLOOKUP(A368,Players!$A$2:$B$92,2,FALSE)","v":{"$error":"#N/A"}},{"$f":"VLOOKUP(B368,Players!A$2:$B$92,2,FALSE)","v":{"$error":"#N/A"}}]
[null,null,2,null,41,{"$f":"IF(C369=1,VLOOKUP(E369,Pivots!$AX$3:$BA$45,2))/2+IF(C369=2,VLOOKUP(E369,Pivots!$AX$3:$BA$45,3))/2+IF(C369=3,VLOOKUP(E369,Pivots!$AX$3:$BA$45,4))/2","v":0},"",{"$f":"VLOOKUP(A369,Players!$A$2:$B$92,2,FALSE)","v":{"$error":"#N/A"}},{"$f":"VLOOKUP(B369,Players!A$2:$B$92,2,FALSE)","v":{"$error":"#N/A"}}]
[null,null,3,null,41,{"$f":"IF(C370=1,VLOOKUP(E370,Pivots!$AX$3:$BA$45,2))/2+IF(C370=2,VLOOKUP(E370,Pivots!$AX$3:$BA$45,3))/2+IF(C370=3,VLOOKUP(E370,Pivots!$AX$3:$BA$45,4))/2","v":0},"",{"$f":"VLOOKUP(A370,Players!$A$2:$B$92,2,FALSE)","v":{"$error":"#N/A"}},{"$f":"VLOOKUP(B370,Players!A$2:$B$92,2,FALSE)","v":{"$error":"#N/A"}}]
[null,null,3,null,41,{"$f":"IF(C371=1,VLOOKUP(E371,Pivots!$AX$3:$BA$45,2))/2+IF(C371=2,VLOOKUP(E371,Pivots!$AX$3:$BA$45,3))/2+IF(C371=3,VLOOKUP(E371,Pivots!$AX$3:$BA$45,4))/2","v":0},"",{"$f":"VLOOKUP(A371,Players!$A$2:$B$92,2,FALSE)","v":{"$error":"#N/A"}},{"$f":"VLOOKUP(B371,Players!A$2:$B$92,2,FALSE)","v":{"$error":"#N/A"}}]
[null,null,3,null,41,{"$f":"IF(C372=1,VLOOKUP(E372,Pivots!$AX$3:$BA$45,2))/2+IF(C372=2,VLOOKUP(E372,Pivots!$AX$3:$BA$45,3))/2+IF(C372=3,VLOOKUP(E372,Pivots!$AX$3:$BA$45,4))/2","v":0},"",{"$f":"VLOOKUP(A372,Players!$A$2:$B$92,2,FALSE)","v":{"$error":"#N/A"}},{"$f":"VLOOKUP(B372,Players!A$2:$B$92,2,FALSE)","v":{"$error":"#N/A"}}]
[null,null,3,null,41,{"$f":"IF(C373=1,VLOOKUP(E373,Pivots!$AX$3:$BA$45,2))/2+IF(C373=2,VLOOKUP(E373,Pivots!$AX$3:$BA$45,3))/2+IF(C373=3,VLOOKUP(E373,Pivots!$AX$3:$BA$45,4))/2","v":0},"",{"$f":"VLOOKUP(A373,Players!$A$2:$B$92,2,FALSE)","v":{"$error":"#N/A"}},{"$f":"VLOOKUP(B373,Players!A$2:$B$92,2,FALSE)","v":{"$error":"#N/A"}}]
[null,null,1,null,{"$f":"E362+1","v":42},{"$f":"IF(C374=1,VLOOKUP(E374,Pivots!$AX$3:$BA$45,2))/2+IF(C374=2,VLOOKUP(E374,Pivots!$AX$3:$BA$45,3))/2+IF(C374=3,VLOOKUP(E374,Pivots!$AX$3:$BA$45,4))/2","v":0},"",{"$f":"VLOOKUP(A374,Players!$A$2:$B$92,2,FALSE)","v":{"$error":"#N/A"}},{"$f":"VLOOKUP(B374,Players!A$2:$B$92,2,FALSE)","v":{"$error":"#N/A"}}]
[null,null,1,null,{"$f":"E374","v":42},{"$f":"IF(C375=1,VLOOKUP(E375,Pivots!$AX$3:$BA$45,2))/2+IF(C375=2,VLOOKUP(E375,Pivots!$AX$3:$BA$45,3))/2+IF(C375=3,VLOOKUP(E375,Pivots!$AX$3:$BA$45,4))/2","v":0},"",{"$f":"VLOOKUP(A375,Players!$A$2:$B$92,2,FALSE)","v":{"$error":"#N/A"}},{"$f":"VLOOKUP(B375,Players!A$2:$B$92,2,FALSE)","v":{"$error":"#N/A"}}]
[null,null,1,null,{"$f":"E375","v":42},{"$f":"IF(C376=1,VLOOKUP(E376,Pivots!$AX$3:$BA$45,2))/2+IF(C376=2,VLOOKUP(E376,Pivots!$AX$3:$BA$45,3))/2+IF(C376=3,VLOOKUP(E376,Pivots!$AX$3:$BA$45,4))/2","v":0},"",{"$f":"VLOOKUP(A376,Players!$A$2:$B$92,2,FALSE)","v":{"$error":"#N/A"}},{"$f":"VLOOKUP(B376,Players!A$2:$B$92,2,FALSE)","v":{"$error":"#N/A"}}]
[null,null,1,null,42,{"$f":"IF(C377=1,VLOOKUP(E377,Pivots!$AX$3:$BA$45,2))/2+IF(C377=2,VLOOKUP(E377,Pivots!$AX$3:$BA$45,3))/2+IF(C377=3,VLOOKUP(E377,Pivots!$AX$3:$BA$45,4))/2","v":0},"",{"$f":"VLOOKUP(A377,Players!$A$2:$B$92,2,FALSE)","v":{"$error":"#N/A"}},{"$f":"VLOOKUP(B377,Players!A$2:$B$92,2,FALSE)","v":{"$error":"#N/A"}}]
[null,null,2,null,42,{"$f":"IF(C378=1,VLOOKUP(E378,Pivots!$AX$3:$BA$45,2))/2+IF(C378=2,VLOOKUP(E378,Pivots!$AX$3:$BA$45,3))/2+IF(C378=3,VLOOKUP(E378,Pivots!$AX$3:$BA$45,4))/2","v":0},"",{"$f":"VLOOKUP(A378,Players!$A$2:$B$92,2,FALSE)","v":{"$error":"#N/A"}},{"$f":"VLOOKUP(B378,Players!A$2:$B$92,2,FALSE)","v":{"$error":"#N/A"}}]
[null,null,2,null,42,{"$f":"IF(C379=1,VLOOKUP(E379,Pivots!$AX$3:$BA$45,2))/2+IF(C379=2,VLOOKUP(E379,Pivots!$AX$3:$BA$45,3))/2+IF(C379=3,VLOOKUP(E379,Pivots!$AX$3:$BA$45,4))/2","v":0},"",{"$f":"VLOOKUP(A379,Players!$A$2:$B$92,2,FALSE)","v":{"$error":"#N/A"}},{"$f":"VLOOKUP(B379,Players!A$2:$B$92,2,FALSE)","v":{"$error":"#N/A"}}]
[null,null,2,null,42,{"$f":"IF(C380=1,VLOOKUP(E380,Pivots!$AX$3:$BA$45,2))/2+IF(C380=2,VLOOKUP(E380,Pivots!$AX$3:$BA$45,3))/2+IF(C380=3,VLOOKUP(E380,Pivots!$AX$3:$BA$45,4))/2","v":0},"",{"$f":"VLOOKUP(A380,Players!$A$2:$B$92,2,FALSE)","v":{"$error":"#N/A"}},{"$f":"VLOOKUP(B380,Players!A$2:$B$92,2,FALSE)","v":{"$error":"#N/A"}}]
[null,null,2,null,42,{"$f":"IF(C381=1,VLOOKUP(E381,Pivots!$AX$3:$BA$45,2))/2+IF(C381=2,VLOOKUP(E381,Pivots!$AX$3:$BA$45,3))/2+IF(C381=3,VLOOKUP(E381,Pivots!$AX$3:$BA$45,4))/2","v":0},"",{"$f":"VLOOKUP(A381,Players!$A$2:$B$92,2,FALSE)","v":{"$error":"#N/A"}},{"$f":"VLOOKUP(B381,Players!A$2:$B$92,2,FALSE)","v":{"$error":"#N/A"}}]
[null,null,3,null,42,{"$f":"IF(C382=1,VLOOKUP(E382,Pivots!$AX$3:$BA$45,2))/2+IF(C382=2,VLOOKUP(E382,Pivots!$AX$3:$BA$45,3))/2+IF(C382=3,VLOOKUP(E382,Pivots!$AX$3:$BA$45,4))/2","v":0},"",{"$f":"VLOOKUP(A382,Players!$A$2:$B$92,2,FALSE)","v":{"$error":"#N/A"}},{"$f":"VLOOKUP(B382,Players!A$2:$B$92,2,FALSE)","v":{"$error":"#N/A"}}]
[null,null,3,null,42,{"$f":"IF(C383=1,VLOOKUP(E383,Pivots!$AX$3:$BA$45,2))/2+IF(C383=2,VLOOKUP(E383,Pivots!$AX$3:$BA$45,3))/2+IF(C383=3,VLOOKUP(E383,Pivots!$AX$3:$BA$45,4))/2","v":0},"",{"$f":"VLOOKUP(A383,Players!$A$2:$B$92,2,FALSE)","v":{"$error":"#N/A"}},{"$f":"VLOOKUP(B383,Players!A$2:$B$92,2,FALSE)","v":{"$error":"#N/A"}}]
[null,null,3,null,42,{"$f":"IF(C384=1,VLOOKUP(E384,Pivots!$AX$3:$BA$45,2))/2+IF(C384=2,VLOOKUP(E384,Pivots!$AX$3:$BA$45,3))/2+IF(C384=3,VLOOKUP(E384,Pivots!$AX$3:$BA$45,4))/2","v":0},"",{"$f":"VLOOKUP(A384,Players!$A$2:$B$92,2,FALSE)","v":{"$error":"#N/A"}},{"$f":"VLOOKUP(B384,Players!A$2:$B$92,2,FALSE)","v":{"$error":"#N/A"}}]
[null,null,3,null,42,{"$f":"IF(C385=1,VLOOKUP(E385,Pivots!$AX$3:$BA$45,2))/2+IF(C385=2,VLOOKUP(E385,Pivots!$AX$3:$BA$45,3))/2+IF(C385=3,VLOOKUP(E385,Pivots!$AX$3:$BA$45,4))/2","v":0},"",{"$f":"VLOOKUP(A385,Players!$A$2:$B$92,2,FALSE)","v":{"$error":"#N/A"}},{"$f":"VLOOKUP(B385,Players!A$2:$B$92,2,FALSE)","v":{"$error":"#N/A"}}]
[null,null,1,null,{"$f":"E374+1","v":43},{"$f":"IF(C386=1,VLOOKUP(E386,Pivots!$AX$3:$BA$45,2))/2+IF(C386=2,VLOOKUP(E386,Pivots!$AX$3:$BA$45,3))/2+IF(C386=3,VLOOKUP(E386,Pivots!$AX$3:$BA$45,4))/2","v":0},{"$f":"IF(A386=\"\",\"\",D386-F386/4)","v":""},{"$f":"VLOOKUP(A386,Players!$A$2:$B$92,2,FALSE)","v":{"$error":"#N/A"}},{"$f":"VLOOKUP(B386,Players!A$2:$B$92,2,FALSE)","v":{"$error":"#N/A"}}]
[null,null,1,null,{"$f":"E386","v":43},{"$f":"IF(C387=1,VLOOKUP(E387,Pivots!$AX$3:$BA$45,2))/2+IF(C387=2,VLOOKUP(E387,Pivots!$AX$3:$BA$45,3))/2+IF(C387=3,VLOOKUP(E387,Pivots!$AX$3:$BA$45,4))/2","v":0},"",{"$f":"VLOOKUP(A387,Players!$A$2:$B$92,2,FALSE)","v":{"$error":"#N/A"}},{"$f":"VLOOKUP(B387,Players!A$2:$B$92,2,FALSE)","v":{"$error":"#N/A"}}]
[null,null,1,null,{"$f":"E387","v":43},{"$f":"IF(C388=1,VLOOKUP(E388,Pivots!$AX$3:$BA$45,2))/2+IF(C388=2,VLOOKUP(E388,Pivots!$AX$3:$BA$45,3))/2+IF(C388=3,VLOOKUP(E388,Pivots!$AX$3:$BA$45,4))/2","v":0},"",{"$f":"VLOOKUP(A388,Players!$A$2:$B$92,2,FALSE)","v":{"$error":"#N/A"}},{"$f":"VLOOKUP(B388,Players!A$2:$B$92,2,FALSE)","v":{"$error":"#N/A"}}]
[null,null,1,null,43,{"$f":"IF(C389=1,VLOOKUP(E389,Pivots!$AX$3:$BA$45,2))/2+IF(C389=2,VLOOKUP(E389,Pivots!$AX$3:$BA$45,3))/2+IF(C389=3,VLOOKUP(E389,Pivots!$AX$3:$BA$45,4))/2","v":0},"",{"$f":"VLOOKUP(A389,Players!$A$2:$B$92,2,FALSE)","v":{"$error":"#N/A"}},{"$f":"VLOOKUP(B389,Players!A$2:$B$92,2,FALSE)","v":{"$error":"#N/A"}}]
[null,null,2,null,43,{"$f":"IF(C390=1,VLOOKUP(E390,Pivots!$AX$3:$BA$45,2))/2+IF(C390=2,VLOOKUP(E390,Pivots!$AX$3:$BA$45,3))/2+IF(C390=3,VLOOKUP(E390,Pivots!$AX$3:$BA$45,4))/2","v":0},"",{"$f":"VLOOKUP(A390,Players!$A$2:$B$92,2,FALSE)","v":{"$error":"#N/A"}},{"$f":"VLOOKUP(B390,Players!A$2:$B$92,2,FALSE)","v":{"$error":"#N/A"}}]
[null,null,2,null,43,{"$f":"IF(C391=1,VLOOKUP(E391,Pivots!$AX$3:$BA$45,2))/2+IF(C391=2,VLOOKUP(E391,Pivots!$AX$3:$BA$45,3))/2+IF(C391=3,VLOOKUP(E391,Pivots!$AX$3:$BA$45,4))/2","v":0},"",{"$f":"VLOOKUP(A391,Players!$A$2:$B$92,2,FALSE)","v":{"$error":"#N/A"}},{"$f":"VLOOKUP(B391,Players!A$2:$B$92,2,FALSE)","v":{"$error":"#N/A"}}]
[null,null,2,null,43,{"$f":"IF(C392=1,VLOOKUP(E392,Pivots!$AX$3:$BA$45,2))/2+IF(C392=2,VLOOKUP(E392,Pivots!$AX$3:$BA$45,3))/2+IF(C392=3,VLOOKUP(E392,Pivots!$AX$3:$BA$45,4))/2","v":0},"",{"$f":"VLOOKUP(A392,Players!$A$2:$B$92,2,FALSE)","v":{"$error":"#N/A"}},{"$f":"VLOOKUP(B392,Players!A$2:$B$92,2,FALSE)","v":{"$error":"#N/A"}}]
[null,null,2,null,43,{"$f":"IF(C393=1,VLOOKUP(E393,Pivots!$AX$3:$BA$45,2))/2+IF(C393=2,VLOOKUP(E393,Pivots!$AX$3:$BA$45,3))/2+IF(C393=3,VLOOKUP(E393,Pivots!$AX$3:$BA$45,4))/2","v":0},"",{"$f":"VLOOKUP(A393,Players!$A$2:$B$92,2,FALSE)","v":{"$error":"#N/A"}},{"$f":"VLOOKUP(B393,Players!A$2:$B$92,2,FALSE)","v":{"$error":"#N/A"}}]
[null,null,3,null,43,{"$f":"IF(C394=1,VLOOKUP(E394,Pivots!$AX$3:$BA$45,2))/2+IF(C394=2,VLOOKUP(E394,Pivots!$AX$3:$BA$45,3))/2+IF(C394=3,VLOOKUP(E394,Pivots!$AX$3:$BA$45,4))/2","v":0},"",{"$f":"VLOOKUP(A394,Players!$A$2:$B$92,2,FALSE)","v":{"$error":"#N/A"}},{"$f":"VLOOKUP(B394,Players!A$2:$B$92,2,FALSE)","v":{"$error":"#N/A"}}]
[null,null,3,null,43,{"$f":"IF(C395=1,VLOOKUP(E395,Pivots!$AX$3:$BA$45,2))/2+IF(C395=2,VLOOKUP(E395,Pivots!$AX$3:$BA$45,3))/2+IF(C395=3,VLOOKUP(E395,Pivots!$AX$3:$BA$45,4))/2","v":0},"",{"$f":"VLOOKUP(A395,Players!$A$2:$B$92,2,FALSE)","v":{"$error":"#N/A"}},{"$f":"VLOOKUP(B395,Players!A$2:$B$92,2,FALSE)","v":{"$error":"#N/A"}}]
[null,null,3,null,43,{"$f":"IF(C396=1,VLOOKUP(E396,Pivots!$AX$3:$BA$45,2))/2+IF(C396=2,VLOOKUP(E396,Pivots!$AX$3:$BA$45,3))/2+IF(C396=3,VLOOKUP(E396,Pivots!$AX$3:$BA$45,4))/2","v":0},"",{"$f":"VLOOKUP(A396,Players!$A$2:$B$92,2,FALSE)","v":{"$error":"#N/A"}},{"$f":"VLOOKUP(B396,Players!A$2:$B$92,2,FALSE)","v":{"$error":"#N/A"}}]
[null,null,3,null,43,{"$f":"IF(C397=1,VLOOKUP(E397,Pivots!$AX$3:$BA$45,2))/2+IF(C397=2,VLOOKUP(E397,Pivots!$AX$3:$BA$45,3))/2+IF(C397=3,VLOOKUP(E397,Pivots!$AX$3:$BA$45,4))/2","v":0},"",{"$f":"VLOOKUP(A397,Players!$A$2:$B$92,2,FALSE)","v":{"$error":"#N/A"}},{"$f":"VLOOKUP(B397,Players!A$2:$B$92,2,FALSE)","v":{"$error":"#N/A"}}]
[null,null,1,null,{"$f":"E386+1","v":44},{"$f":"IF(C398=1,VLOOKUP(E398,Pivots!$AX$3:$BA$45,2))/2+IF(C398=2,VLOOKUP(E398,Pivots!$AX$3:$BA$45,3))/2+IF(C398=3,VLOOKUP(E398,Pivots!$AX$3:$BA$45,4))/2","v":0},"",{"$f":"VLOOKUP(A398,Players!$A$2:$B$92,2,FALSE)","v":{"$error":"#N/A"}},{"$f":"VLOOKUP(B398,Players!A$2:$B$92,2,FALSE)","v":{"$error":"#N/A"}}]
[null,null,1,null,{"$f":"E398","v":44},{"$f":"IF(C399=1,VLOOKUP(E399,Pivots!$AX$3:$BA$45,2))/2+IF(C399=2,VLOOKUP(E399,Pivots!$AX$3:$BA$45,3))/2+IF(C399=3,VLOOKUP(E399,Pivots!$AX$3:$BA$45,4))/2","v":0},"",{"$f":"VLOOKUP(A399,Players!$A$2:$B$92,2,FALSE)","v":{"$error":"#N/A"}},{"$f":"VLOOKUP(B399,Players!A$2:$B$92,2,FALSE)","v":{"$error":"#N/A"}}]
[null,null,1,null,{"$f":"E399","v":44},{"$f":"IF(C400=1,VLOOKUP(E400,Pivots!$AX$3:$BA$45,2))/2+IF(C400=2,VLOOKUP(E400,Pivots!$AX$3:$BA$45,3))/2+IF(C400=3,VLOOKUP(E400,Pivots!$AX$3:$BA$45,4))/2","v":0},"",{"$f":"VLOOKUP(A400,Players!$A$2:$B$92,2,FALSE)","v":{"$error":"#N/A"}},{"$f":"VLOOKUP(B400,Players!A$2:$B$92,2,FALSE)","v":{"$error":"#N/A"}}]
[null,null,1,null,44,{"$f":"IF(C401=1,VLOOKUP(E401,Pivots!$AX$3:$BA$45,2))/2+IF(C401=2,VLOOKUP(E401,Pivots!$AX$3:$BA$45,3))/2+IF(C401=3,VLOOKUP(E401,Pivots!$AX$3:$BA$45,4))/2","v":0},"",{"$f":"VLOOKUP(A401,Players!$A$2:$B$92,2,FALSE)","v":{"$error":"#N/A"}},{"$f":"VLOOKUP(B401,Players!A$2:$B$92,2,FALSE)","v":{"$error":"#N/A"}}]
[null,null,2,null,44,{"$f":"IF(C402=1,VLOOKUP(E402,Pivots!$AX$3:$BA$45,2))/2+IF(C402=2,VLOOKUP(E402,Pivots!$AX$3:$BA$45,3))/2+IF(C402=3,VLOOKUP(E402,Pivots!$AX$3:$BA$45,4))/2","v":0},"",{"$f":"VLOOKUP(A402,Players!$A$2:$B$92,2,FALSE)","v":{"$error":"#N/A"}},{"$f":"VLOOKUP(B402,Players!A$2:$B$92,2,FALSE)","v":{"$error":"#N/A"}}]
[null,null,2,null,44,{"$f":"IF(C403=1,VLOOKUP(E403,Pivots!$AX$3:$BA$45,2))/2+IF(C403=2,VLOOKUP(E403,Pivots!$AX$3:$BA$45,3))/2+IF(C403=3,VLOOKUP(E403,Pivots!$AX$3:$BA$45,4))/2","v":0},"",{"$f":"VLOOKUP(A403,Players!$A$2:$B$92,2,FALSE)","v":{"$error":"#N/A"}},{"$f":"VLOOKUP(B403,Players!A$2:$B$92,2,FALSE)","v":{"$error":"#N/A"}}]
[null,null,2,null,44,{"$f":"IF(C404=1,VLOOKUP(E404,Pivots!$AX$3:$BA$45,2))/2+IF(C404=2,VLOOKUP(E404,Pivots!$AX$3:$BA$45,3))/2+IF(C404=3,VLOOKUP(E404,Pivots!$AX$3:$BA$45,4))/2","v":0},"",{"$f":"VLOOKUP(A404,Players!$A$2:$B$92,2,FALSE)","v":{"$error":"#N/A"}},{"$f":"VLOOKUP(B404,Players!A$2:$B$92,2,FALSE)","v":{"$error":"#N/A"}}]
[null,null,2,null,44,{"$f":"IF(C405=1,VLOOKUP(E405,Pivots!$AX$3:$BA$45,2))/2+IF(C405=2,VLOOKUP(E405,Pivots!$AX$3:$BA$45,3))/2+IF(C405=3,VLOOKUP(E405,Pivots!$AX$3:$BA$45,4))/2","v":0},"",{"$f":"VLOOKUP(A405,Players!$A$2:$B$92,2,FALSE)","v":{"$error":"#N/A"}},{"$f":"VLOOKUP(B405,Players!A$2:$B$92,2,FALSE)","v":{"$error":"#N/A"}}]
[null,null,3,null,44,{"$f":"IF(C406=1,VLOOKUP(E406,Pivots!$AX$3:$BA$45,2))/2+IF(C406=2,VLOOKUP(E406,Pivots!$AX$3:$BA$45,3))/2+IF(C406=3,VLOOKUP(E406,Pivots!$AX$3:$BA$45,4))/2","v":0},"",{"$f":"VLOOKUP(A406,Players!$A$2:$B$92,2,FALSE)","v":{"$error":"#N/A"}},{"$f":"VLOOKUP(B406,Players!A$2:$B$92,2,FALSE)","v":{"$error":"#N/A"}}]
[null,null,3,null,44,{"$f":"IF(C407=1,VLOOKUP(E407,Pivots!$AX$3:$BA$45,2))/2+IF(C407=2,VLOOKUP(E407,Pivots!$AX$3:$BA$45,3))/2+IF(C407=3,VLOOKUP(E407,Pivots!$AX$3:$BA$45,4))/2","v":0},"",{"$f":"VLOOKUP(A407,Players!$A$2:$B$92,2,FALSE)","v":{"$error":"#N/A"}},{"$f":"VLOOKUP(B407,Players!A$2:$B$92,2,FALSE)","v":{"$error":"#N/A"}}]
[null,null,3,null,44,{"$f":"IF(C408=1,VLOOKUP(E408,Pivots!$AX$3:$BA$45,2))/2+IF(C408=2,VLOOKUP(E408,Pivots!$AX$3:$BA$45,3))/2+IF(C408=3,VLOOKUP(E408,Pivots!$AX$3:$BA$45,4))/2","v":0},"",{"$f":"VLOOKUP(A408,Players!$A$2:$B$92,2,FALSE)","v":{"$error":"#N/A"}},{"$f":"VLOOKUP(B408,Players!A$2:$B$92,2,FALSE)","v":{"$error":"#N/A"}}]
[null,null,3,null,44,{"$f":"IF(C409=1,VLOOKUP(E409,Pivots!$AX$3:$BA$45,2))/2+IF(C409=2,VLOOKUP(E409,Pivots!$AX$3:$BA$45,3))/2+IF(C409=3,VLOOKUP(E409,Pivots!$AX$3:$BA$45,4))/2","v":0},"",{"$f":"VLOOKUP(A409,Players!$A$2:$B$92,2,FALSE)","v":{"$error":"#N/A"}},{"$f":"VLOOKUP(B409,Players!A$2:$B$92,2,FALSE)","v":{"$error":"#N/A"}}]
[null,null,1,null,{"$f":"E398+1","v":45},{"$f":"IF(C410=1,VLOOKUP(E410,Pivots!$AX$3:$BA$45,2))/2+IF(C410=2,VLOOKUP(E410,Pivots!$AX$3:$BA$45,3))/2+IF(C410=3,VLOOKUP(E410,Pivots!$AX$3:$BA$45,4))/2","v":0},"",{"$f":"VLOOKUP(A410,Players!$A$2:$B$92,2,FALSE)","v":{"$error":"#N/A"}},{"$f":"VLOOKUP(B410,Players!A$2:$B$92,2,FALSE)","v":{"$error":"#N/A"}}]
[null,null,1,null,{"$f":"E410","v":45},{"$f":"IF(C411=1,VLOOKUP(E411,Pivots!$AX$3:$BA$45,2))/2+IF(C411=2,VLOOKUP(E411,Pivots!$AX$3:$BA$45,3))/2+IF(C411=3,VLOOKUP(E411,Pivots!$AX$3:$BA$45,4))/2","v":0},"",{"$f":"VLOOKUP(A411,Players!$A$2:$B$92,2,FALSE)","v":{"$error":"#N/A"}},{"$f":"VLOOKUP(B411,Players!A$2:$B$92,2,FALSE)","v":{"$error":"#N/A"}}]
[null,null,1,null,{"$f":"E411","v":45},{"$f":"IF(C412=1,VLOOKUP(E412,Pivots!$AX$3:$BA$45,2))/2+IF(C412=2,VLOOKUP(E412,Pivots!$AX$3:$BA$45,3))/2+IF(C412=3,VLOOKUP(E412,Pivots!$AX$3:$BA$45,4))/2","v":0},"",{"$f":"VLOOKUP(A412,Players!$A$2:$B$92,2,FALSE)","v":{"$error":"#N/A"}},{"$f":"VLOOKUP(B412,Players!A$2:$B$92,2,FALSE)","v":{"$error":"#N/A"}}]
[null,null,1,null,45,{"$f":"IF(C413=1,VLOOKUP(E413,Pivots!$AX$3:$BA$45,2))/2+IF(C413=2,VLOOKUP(E413,Pivots!$AX$3:$BA$45,3))/2+IF(C413=3,VLOOKUP(E413,Pivots!$AX$3:$BA$45,4))/2","v":0},"",{"$f":"VLOOKUP(A413,Players!$A$2:$B$92,2,FALSE)","v":{"$error":"#N/A"}},{"$f":"VLOOKUP(B413,Players!A$2:$B$92,2,FALSE)","v":{"$error":"#N/A"}}]
[null,null,2,null,45,{"$f":"IF(C414=1,VLOOKUP(E414,Pivots!$AX$3:$BA$45,2))/2+IF(C414=2,VLOOKUP(E414,Pivots!$AX$3:$BA$45,3))/2+IF(C414=3,VLOOKUP(E414,Pivots!$AX$3:$BA$45,4))/2","v":0},"",{"$f":"VLOOKUP(A414,Players!$A$2:$B$92,2,FALSE)","v":{"$error":"#N/A"}},{"$f":"VLOOKUP(B414,Players!A$2:$B$92,2,FALSE)","v":{"$error":"#N/A"}}]
[null,null,2,null,45,{"$f":"IF(C415=1,VLOOKUP(E415,Pivots!$AX$3:$BA$45,2))/2+IF(C415=2,VLOOKUP(E415,Pivots!$AX$3:$BA$45,3))/2+IF(C415=3,VLOOKUP(E415,Pivots!$AX$3:$BA$45,4))/2","v":0},"",{"$f":"VLOOKUP(A415,Players!$A$2:$B$92,2,FALSE)","v":{"$error":"#N/A"}},{"$f":"VLOOKUP(B415,Players!A$2:$B$92,2,FALSE)","v":{"$error":"#N/A"}}]
[null,null,2,null,45,{"$f":"IF(C416=1,VLOOKUP(E416,Pivots!$AX$3:$BA$45,2))/2+IF(C416=2,VLOOKUP(E416,Pivots!$AX$3:$BA$45,3))/2+IF(C416=3,VLOOKUP(E416,Pivots!$AX$3:$BA$45,4))/2","v":0},"",{"$f":"VLOOKUP(A416,Players!$A$2:$B$92,2,FALSE)","v":{"$error":"#N/A"}},{"$f":"VLOOKUP(B416,Players!A$2:$B$92,2,FALSE)","v":{"$error":"#N/A"}}]
[null,null,2,null,45,{"$f":"IF(C417=1,VLOOKUP(E417,Pivots!$AX$3:$BA$45,2))/2+IF(C417=2,VLOOKUP(E417,Pivots!$AX$3:$BA$45,3))/2+IF(C417=3,VLOOKUP(E417,Pivots!$AX$3:$BA$45,4))/2","v":0},"",{"$f":"VLOOKUP(A417,Players!$A$2:$B$92,2,FALSE)","v":{"$error":"#N/A"}},{"$f":"VLOOKUP(B417,Players!A$2:$B$92,2,FALSE)","v":{"$error":"#N/A"}}]
[null,null,3,null,45,{"$f":"IF(C418=1,VLOOKUP(E418,Pivots!$AX$3:$BA$45,2))/2+IF(C418=2,VLOOKUP(E418,Pivots!$AX$3:$BA$45,3))/2+IF(C418=3,VLOOKUP(E418,Pivots!$AX$3:$BA$45,4))/2","v":0},"",{"$f":"VLOOKUP(A418,Players!$A$2:$B$92,2,FALSE)","v":{"$error":"#N/A"}},{"$f":"VLOOKUP(B418,Players!A$2:$B$92,2,FALSE)","v":{"$error":"#N/A"}}]
[null,null,3,null,45,{"$f":"IF(C419=1,VLOOKUP(E419,Pivots!$AX$3:$BA$45,2))/2+IF(C419=2,VLOOKUP(E419,Pivots!$AX$3:$BA$45,3))/2+IF(C419=3,VLOOKUP(E419,Pivots!$AX$3:$BA$45,4))/2","v":0},"",{"$f":"VLOOKUP(A419,Players!$A$2:$B$92,2,FALSE)","v":{"$error":"#N/A"}},{"$f":"VLOOKUP(B419,Players!A$2:$B$92,2,FALSE)","v":{"$error":"#N/A"}}]
[null,null,3,null,45,{"$f":"IF(C420=1,VLOOKUP(E420,Pivots!$AX$3:$BA$45,2))/2+IF(C420=2,VLOOKUP(E420,Pivots!$AX$3:$BA$45,3))/2+IF(C420=3,VLOOKUP(E420,Pivots!$AX$3:$BA$45,4))/2","v":0},"",{"$f":"VLOOKUP(A420,Players!$A$2:$B$92,2,FALSE)","v":{"$error":"#N/A"}},{"$f":"VLOOKUP(B420,Players!A$2:$B$92,2,FALSE)","v":{"$error":"#N/A"}}]
[null,null,3,null,45,{"$f":"IF(C421=1,VLOOKUP(E421,Pivots!$AX$3:$BA$45,2))/2+IF(C421=2,VLOOKUP(E421,Pivots!$AX$3:$BA$45,3))/2+IF(C421=3,VLOOKUP(E421,Pivots!$AX$3:$BA$45,4))/2","v":0},"",{"$f":"VLOOKUP(A421,Players!$A$2:$B$92,2,FALSE)","v":{"$error":"#N/A"}},{"$f":"VLOOKUP(B421,Players!A$2:$B$92,2,FALSE)","v":{"$error":"#N/A"}}]
[null,null,1,null,{"$f":"E410+1","v":46},{"$f":"IF(C422=1,VLOOKUP(E422,Pivots!$AX$3:$BA$45,2))/2+IF(C422=2,VLOOKUP(E422,Pivots!$AX$3:$BA$45,3))/2+IF(C422=3,VLOOKUP(E422,Pivots!$AX$3:$BA$45,4))/2","v":0},"",{"$f":"VLOOKUP(A422,Players!$A$2:$B$92,2,FALSE)","v":{"$error":"#N/A"}},{"$f":"VLOOKUP(B422,Players!A$2:$B$92,2,FALSE)","v":{"$error":"#N/A"}}]
[null,null,1,null,{"$f":"E422","v":46},{"$f":"IF(C423=1,VLOOKUP(E423,Pivots!$AX$3:$BA$45,2))/2+IF(C423=2,VLOOKUP(E423,Pivots!$AX$3:$BA$45,3))/2+IF(C423=3,VLOOKUP(E423,Pivots!$AX$3:$BA$45,4))/2","v":0},"",{"$f":"VLOOKUP(A423,Players!$A$2:$B$92,2,FALSE)","v":{"$error":"#N/A"}},{"$f":"VLOOKUP(B423,Players!A$2:$B$92,2,FALSE)","v":{"$error":"#N/A"}}]
[null,null,1,null,{"$f":"E423","v":46},{"$f":"IF(C424=1,VLOOKUP(E424,Pivots!$AX$3:$BA$45,2))/2+IF(C424=2,VLOOKUP(E424,Pivots!$AX$3:$BA$45,3))/2+IF(C424=3,VLOOKUP(E424,Pivots!$AX$3:$BA$45,4))/2","v":0},"",{"$f":"VLOOKUP(A424,Players!$A$2:$B$92,2,FALSE)","v":{"$error":"#N/A"}},{"$f":"VLOOKUP(B424,Players!A$2:$B$92,2,FALSE)","v":{"$error":"#N/A"}}]
[null,null,1,null,46,{"$f":"IF(C425=1,VLOOKUP(E425,Pivots!$AX$3:$BA$45,2))/2+IF(C425=2,VLOOKUP(E425,Pivots!$AX$3:$BA$45,3))/2+IF(C425=3,VLOOKUP(E425,Pivots!$AX$3:$BA$45,4))/2","v":0},"",{"$f":"VLOOKUP(A425,Players!$A$2:$B$92,2,FALSE)","v":{"$error":"#N/A"}},{"$f":"VLOOKUP(B425,Players!A$2:$B$92,2,FALSE)","v":{"$error":"#N/A"}}]
[null,null,2,null,46,{"$f":"IF(C426=1,VLOOKUP(E426,Pivots!$AX$3:$BA$45,2))/2+IF(C426=2,VLOOKUP(E426,Pivots!$AX$3:$BA$45,3))/2+IF(C426=3,VLOOKUP(E426,Pivots!$AX$3:$BA$45,4))/2","v":0},"",{"$f":"VLOOKUP(A426,Players!$A$2:$B$92,2,FALSE)","v":{"$error":"#N/A"}},{"$f":"VLOOKUP(B426,Players!A$2:$B$92,2,FALSE)","v":{"$error":"#N/A"}}]
[null,null,2,null,46,{"$f":"IF(C427=1,VLOOKUP(E427,Pivots!$AX$3:$BA$45,2))/2+IF(C427=2,VLOOKUP(E427,Pivots!$AX$3:$BA$45,3))/2+IF(C427=3,VLOOKUP(E427,Pivots!$AX$3:$BA$45,4))/2","v":0},"",{"$f":"VLOOKUP(A427,Players!$A$2:$B$92,2,FALSE)","v":{"$error":"#N/A"}},{"$f":"VLOOKUP(B427,Players!A$2:$B$92,2,FALSE)","v":{"$error":"#N/A"}}]
[null,null,2,null,46,{"$f":"IF(C428=1,VLOOKUP(E428,Pivots!$AX$3:$BA$45,2))/2+IF(C428=2,VLOOKUP(E428,Pivots!$AX$3:$BA$45,3))/2+IF(C428=3,VLOOKUP(E428,Pivots!$AX$3:$BA$45,4))/2","v":0},"",{"$f":"VLOOKUP(A428,Players!$A$2:$B$92,2,FALSE)","v":{"$error":"#N/A"}},{"$f":"VLOOKUP(B428,Players!A$2:$B$92,2,FALSE)","v":{"$error":"#N/A"}}]
[null,null,2,null,46,{"$f":"IF(C429=1,VLOOKUP(E429,Pivots!$AX$3:$BA$45,2))/2+IF(C429=2,VLOOKUP(E429,Pivots!$AX$3:$BA$45,3))/2+IF(C429=3,VLOOKUP(E429,Pivots!$AX$3:$BA$45,4))/2","v":0},"",{"$f":"VLOOKUP(A429,Players!$A$2:$B$92,2,FALSE)","v":{"$error":"#N/A"}},{"$f":"VLOOKUP(B429,Players!A$2:$B$92,2,FALSE)","v":{"$error":"#N/A"}}]
[null,null,3,null,46,{"$f":"IF(C430=1,VLOOKUP(E430,Pivots!$AX$3:$BA$45,2))/2+IF(C430=2,VLOOKUP(E430,Pivots!$AX$3:$BA$45,3))/2+IF(C430=3,VLOOKUP(E430,Pivots!$AX$3:$BA$45,4))/2","v":0},"",{"$f":"VLOOKUP(A430,Players!$A$2:$B$92,2,FALSE)","v":{"$error":"#N/A"}},{"$f":"VLOOKUP(B430,Players!A$2:$B$92,2,FALSE)","v":{"$error":"#N/A"}}]
[null,null,3,null,46,{"$f":"IF(C431=1,VLOOKUP(E431,Pivots!$AX$3:$BA$45,2))/2+IF(C431=2,VLOOKUP(E431,Pivots!$AX$3:$BA$45,3))/2+IF(C431=3,VLOOKUP(E431,Pivots!$AX$3:$BA$45,4))/2","v":0},"",{"$f":"VLOOKUP(A431,Players!$A$2:$B$92,2,FALSE)","v":{"$error":"#N/A"}},{"$f":"VLOOKUP(B431,Players!A$2:$B$92,2,FALSE)","v":{"$error":"#N/A"}}]
[null,null,3,null,46,{"$f":"IF(C432=1,VLOOKUP(E432,Pivots!$AX$3:$BA$45,2))/2+IF(C432=2,VLOOKUP(E432,Pivots!$AX$3:$BA$45,3))/2+IF(C432=3,VLOOKUP(E432,Pivots!$AX$3:$BA$45,4))/2","v":0},"",{"$f":"VLOOKUP(A432,Players!$A$2:$B$92,2,FALSE)","v":{"$error":"#N/A"}},{"$f":"VLOOKUP(B432,Players!A$2:$B$92,2,FALSE)","v":{"$error":"#N/A"}}]
[null,null,3,null,46,{"$f":"IF(C433=1,VLOOKUP(E433,Pivots!$AX$3:$BA$45,2))/2+IF(C433=2,VLOOKUP(E433,Pivots!$AX$3:$BA$45,3))/2+IF(C433=3,VLOOKUP(E433,Pivots!$AX$3:$BA$45,4))/2","v":0},"",{"$f":"VLOOKUP(A433,Players!$A$2:$B$92,2,FALSE)","v":{"$error":"#N/A"}},{"$f":"VLOOKUP(B433,Players!A$2:$B$92,2,FALSE)","v":{"$error":"#N/A"}}]
[null,null,1,null,{"$f":"E422+1","v":47},{"$f":"IF(C434=1,VLOOKUP(E434,Pivots!$AX$3:$BA$45,2))/2+IF(C434=2,VLOOKUP(E434,Pivots!$AX$3:$BA$45,3))/2+IF(C434=3,VLOOKUP(E434,Pivots!$AX$3:$BA$45,4))/2","v":0},"",{"$f":"VLOOKUP(A434,Players!$A$2:$B$92,2,FALSE)","v":{"$error":"#N/A"}},{"$f":"VLOOKUP(B434,Players!A$2:$B$92,2,FALSE)","v":{"$error":"#N/A"}}]
[null,null,1,null,{"$f":"E434","v":47},{"$f":"IF(C435=1,VLOOKUP(E435,Pivots!$AX$3:$BA$45,2))/2+IF(C435=2,VLOOKUP(E435,Pivots!$AX$3:$BA$45,3))/2+IF(C435=3,VLOOKUP(E435,Pivots!$AX$3:$BA$45,4))/2","v":0},"",{"$f":"VLOOKUP(A435,Players!$A$2:$B$92,2,FALSE)","v":{"$error":"#N/A"}},{"$f":"VLOOKUP(B435,Players!A$2:$B$92,2,FALSE)","v":{"$error":"#N/A"}}]
[null,null,1,null,{"$f":"E435","v":47},{"$f":"IF(C436=1,VLOOKUP(E436,Pivots!$AX$3:$BA$45,2))/2+IF(C436=2,VLOOKUP(E436,Pivots!$AX$3:$BA$45,3))/2+IF(C436=3,VLOOKUP(E436,Pivots!$AX$3:$BA$45,4))/2","v":0},"",{"$f":"VLOOKUP(A436,Players!$A$2:$B$92,2,FALSE)","v":{"$error":"#N/A"}},{"$f":"VLOOKUP(B436,Players!A$2:$B$92,2,FALSE)","v":{"$error":"#N/A"}}]
[null,null,1,null,47,{"$f":"IF(C437=1,VLOOKUP(E437,Pivots!$AX$3:$BA$45,2))/2+IF(C437=2,VLOOKUP(E437,Pivots!$AX$3:$BA$45,3))/2+IF(C437=3,VLOOKUP(E437,Pivots!$AX$3:$BA$45,4))/2","v":0},"",{"$f":"VLOOKUP(A437,Players!$A$2:$B$92,2,FALSE)","v":{"$error":"#N/A"}},{"$f":"VLOOKUP(B437,Players!A$2:$B$92,2,FALSE)","v":{"$error":"#N/A"}}]
[null,null,2,null,47,{"$f":"IF(C438=1,VLOOKUP(E438,Pivots!$AX$3:$BA$45,2))/2+IF(C438=2,VLOOKUP(E438,Pivots!$AX$3:$BA$45,3))/2+IF(C438=3,VLOOKUP(E438,Pivots!$AX$3:$BA$45,4))/2","v":0},"",{"$f":"VLOOKUP(A438,Players!$A$2:$B$92,2,FALSE)","v":{"$error":"#N/A"}},{"$f":"VLOOKUP(B438,Players!A$2:$B$92,2,FALSE)","v":{"$error":"#N/A"}}]
[null,null,2,null,47,{"$f":"IF(C439=1,VLOOKUP(E439,Pivots!$AX$3:$BA$45,2))/2+IF(C439=2,VLOOKUP(E439,Pivots!$AX$3:$BA$45,3))/2+IF(C439=3,VLOOKUP(E439,Pivots!$AX$3:$BA$45,4))/2","v":0},"",{"$f":"VLOOKUP(A439,Players!$A$2:$B$92,2,FALSE)","v":{"$error":"#N/A"}},{"$f":"VLOOKUP(B439,Players!A$2:$B$92,2,FALSE)","v":{"$error":"#N/A"}}]
[null,null,2,null,47,{"$f":"IF(C440=1,VLOOKUP(E440,Pivots!$AX$3:$BA$45,2))/2+IF(C440=2,VLOOKUP(E440,Pivots!$AX$3:$BA$45,3))/2+IF(C440=3,VLOOKUP(E440,Pivots!$AX$3:$BA$45,4))/2","v":0},"",{"$f":"VLOOKUP(A440,Players!$A$2:$B$92,2,FALSE)","v":{"$error":"#N/A"}},{"$f":"VLOOKUP(B440,Players!A$2:$B$92,2,FALSE)","v":{"$error":"#N/A"}}]
[null,null,2,null,47,{"$f":"IF(C441=1,VLOOKUP(E441,Pivots!$AX$3:$BA$45,2))/2+IF(C441=2,VLOOKUP(E441,Pivots!$AX$3:$BA$45,3))/2+IF(C441=3,VLOOKUP(E441,Pivots!$AX$3:$BA$45,4))/2","v":0},"",{"$f":"VLOOKUP(A441,Players!$A$2:$B$92,2,FALSE)","v":{"$error":"#N/A"}},{"$f":"VLOOKUP(B441,Players!A$2:$B$92,2,FALSE)","v":{"$error":"#N/A"}}]
[null,null,3,null,47,{"$f":"IF(C442=1,VLOOKUP(E442,Pivots!$AX$3:$BA$45,2))/2+IF(C442=2,VLOOKUP(E442,Pivots!$AX$3:$BA$45,3))/2+IF(C442=3,VLOOKUP(E442,Pivots!$AX$3:$BA$45,4))/2","v":0},"",{"$f":"VLOOKUP(A442,Players!$A$2:$B$92,2,FALSE)","v":{"$error":"#N/A"}},{"$f":"VLOOKUP(B442,Players!A$2:$B$92,2,FALSE)","v":{"$error":"#N/A"}}]
[null,null,3,null,47,{"$f":"IF(C443=1,VLOOKUP(E443,Pivots!$AX$3:$BA$45,2))/2+IF(C443=2,VLOOKUP(E443,Pivots!$AX$3:$BA$45,3))/2+IF(C443=3,VLOOKUP(E443,Pivots!$AX$3:$BA$45,4))/2","v":0},"",{"$f":"VLOOKUP(A443,Players!$A$2:$B$92,2,FALSE)","v":{"$error":"#N/A"}},{"$f":"VLOOKUP(B443,Players!A$2:$B$92,2,FALSE)","v":{"$error":"#N/A"}}]
[null,null,3,null,47,{"$f":"IF(C444=1,VLOOKUP(E444,Pivots!$AX$3:$BA$45,2))/2+IF(C444=2,VLOOKUP(E444,Pivots!$AX$3:$BA$45,3))/2+IF(C444=3,VLOOKUP(E444,Pivots!$AX$3:$BA$45,4))/2","v":0},"",{"$f":"VLOOKUP(A444,Players!$A$2:$B$92,2,FALSE)","v":{"$error":"#N/A"}},{"$f":"VLOOKUP(B444,Players!A$2:$B$92,2,FALSE)","v":{"$error":"#N/A"}}]
[null,null,3,null,47,{"$f":"IF(C445=1,VLOOKUP(E445,Pivots!$AX$3:$BA$45,2))/2+IF(C445=2,VLOOKUP(E445,Pivots!$AX$3:$BA$45,3))/2+IF(C445=3,VLOOKUP(E445,Pivots!$AX$3:$BA$45,4))/2","v":0},"",{"$f":"VLOOKUP(A445,Players!$A$2:$B$92,2,FALSE)","v":{"$error":"#N/A"}},{"$f":"VLOOKUP(B445,Players!A$2:$B$92,2,FALSE)","v":{"$error":"#N/A"}}]
[null,null,1,null,{"$f":"E434+1","v":48},{"$f":"IF(C446=1,VLOOKUP(E446,Pivots!$AX$3:$BA$45,2))/2+IF(C446=2,VLOOKUP(E446,Pivots!$AX$3:$BA$45,3))/2+IF(C446=3,VLOOKUP(E446,Pivots!$AX$3:$BA$45,4))/2","v":0},"",{"$f":"VLOOKUP(A446,Players!$A$2:$B$92,2,FALSE)","v":{"$error":"#N/A"}},{"$f":"VLOOKUP(B446,Players!A$2:$B$92,2,FALSE)","v":{"$error":"#N/A"}}]
[null,null,1,null,{"$f":"E446","v":48},{"$f":"IF(C447=1,VLOOKUP(E447,Pivots!$AX$3:$BA$45,2))/2+IF(C447=2,VLOOKUP(E447,Pivots!$AX$3:$BA$45,3))/2+IF(C447=3,VLOOKUP(E447,Pivots!$AX$3:$BA$45,4))/2","v":0},"",{"$f":"VLOOKUP(A447,Players!$A$2:$B$92,2,FALSE)","v":{"$error":"#N/A"}},{"$f":"VLOOKUP(B447,Players!A$2:$B$92,2,FALSE)","v":{"$error":"#N/A"}}]
[null,null,1,null,{"$f":"E447","v":48},{"$f":"IF(C448=1,VLOOKUP(E448,Pivots!$AX$3:$BA$45,2))/2+IF(C448=2,VLOOKUP(E448,Pivots!$AX$3:$BA$45,3))/2+IF(C448=3,VLOOKUP(E448,Pivots!$AX$3:$BA$45,4))/2","v":0},"",{"$f":"VLOOKUP(A448,Players!$A$2:$B$92,2,FALSE)","v":{"$error":"#N/A"}},{"$f":"VLOOKUP(B448,Players!A$2:$B$92,2,FALSE)","v":{"$error":"#N/A"}}]
[null,null,1,null,48,{"$f":"IF(C449=1,VLOOKUP(E449,Pivots!$AX$3:$BA$45,2))/2+IF(C449=2,VLOOKUP(E449,Pivots!$AX$3:$BA$45,3))/2+IF(C449=3,VLOOKUP(E449,Pivots!$AX$3:$BA$45,4))/2","v":0},"",{"$f":"VLOOKUP(A449,Players!$A$2:$B$92,2,FALSE)","v":{"$error":"#N/A"}},{"$f":"VLOOKUP(B449,Players!A$2:$B$92,2,FALSE)","v":{"$error":"#N/A"}}]
[null,null,2,null,48,{"$f":"IF(C450=1,VLOOKUP(E450,Pivots!$AX$3:$BA$45,2))/2+IF(C450=2,VLOOKUP(E450,Pivots!$AX$3:$BA$45,3))/2+IF(C450=3,VLOOKUP(E450,Pivots!$AX$3:$BA$45,4))/2","v":0},{"$f":"IF(A450=\"\",\"\",D450-F450/4)","v":""},{"$f":"VLOOKUP(A450,Players!$A$2:$B$92,2,FALSE)","v":{"$error":"#N/A"}},{"$f":"VLOOKUP(B450,Players!A$2:$B$92,2,FALSE)","v":{"$error":"#N/A"}}]
[null,null,2,null,48,{"$f":"IF(C451=1,VLOOKUP(E451,Pivots!$AX$3:$BA$45,2))/2+IF(C451=2,VLOOKUP(E451,Pivots!$AX$3:$BA$45,3))/2+IF(C451=3,VLOOKUP(E451,Pivots!$AX$3:$BA$45,4))/2","v":0},"",{"$f":"VLOOKUP(A451,Players!$A$2:$B$92,2,FALSE)","v":{"$error":"#N/A"}},{"$f":"VLOOKUP(B451,Players!A$2:$B$92,2,FALSE)","v":{"$error":"#N/A"}}]
[null,null,2,null,48,{"$f":"IF(C452=1,VLOOKUP(E452,Pivots!$AX$3:$BA$45,2))/2+IF(C452=2,VLOOKUP(E452,Pivots!$AX$3:$BA$45,3))/2+IF(C452=3,VLOOKUP(E452,Pivots!$AX$3:$BA$45,4))/2","v":0},"",{"$f":"VLOOKUP(A452,Players!$A$2:$B$92,2,FALSE)","v":{"$error":"#N/A"}},{"$f":"VLOOKUP(B452,Players!A$2:$B$92,2,FALSE)","v":{"$error":"#N/A"}}]
[null,null,2,null,48,{"$f":"IF(C453=1,VLOOKUP(E453,Pivots!$AX$3:$BA$45,2))/2+IF(C453=2,VLOOKUP(E453,Pivots!$AX$3:$BA$45,3))/2+IF(C453=3,VLOOKUP(E453,Pivots!$AX$3:$BA$45,4))/2","v":0},"",{"$f":"VLOOKUP(A453,Players!$A$2:$B$92,2,FALSE)","v":{"$error":"#N/A"}},{"$f":"VLOOKUP(B453,Players!A$2:$B$92,2,FALSE)","v":{"$error":"#N/A"}}]
[null,null,3,null,48,{"$f":"IF(C454=1,VLOOKUP(E454,Pivots!$AX$3:$BA$45,2))/2+IF(C454=2,VLOOKUP(E454,Pivots!$AX$3:$BA$45,3))/2+IF(C454=3,VLOOKUP(E454,Pivots!$AX$3:$BA$45,4))/2","v":0},"",{"$f":"VLOOKUP(A454,Players!$A$2:$B$92,2,FALSE)","v":{"$error":"#N/A"}},{"$f":"VLOOKUP(B454,Players!A$2:$B$92,2,FALSE)","v":{"$error":"#N/A"}}]
[null,null,3,null,48,{"$f":"IF(C455=1,VLOOKUP(E455,Pivots!$AX$3:$BA$45,2))/2+IF(C455=2,VLOOKUP(E455,Pivots!$AX$3:$BA$45,3))/2+IF(C455=3,VLOOKUP(E455,Pivots!$AX$3:$BA$45,4))/2","v":0},"",{"$f":"VLOOKUP(A455,Players!$A$2:$B$92,2,FALSE)","v":{"$error":"#N/A"}},{"$f":"VLOOKUP(B455,Players!A$2:$B$92,2,FALSE)","v":{"$error":"#N/A"}}]
[null,null,3,null,48,{"$f":"IF(C456=1,VLOOKUP(E456,Pivots!$AX$3:$BA$45,2))/2+IF(C456=2,VLOOKUP(E456,Pivots!$AX$3:$BA$45,3))/2+IF(C456=3,VLOOKUP(E456,Pivots!$AX$3:$BA$45,4))/2","v":0},"",{"$f":"VLOOKUP(A456,Players!$A$2:$B$92,2,FALSE)","v":{"$error":"#N/A"}},{"$f":"VLOOKUP(B456,Players!A$2:$B$92,2,FALSE)","v":{"$error":"#N/A"}}]
[null,null,3,null,48,{"$f":"IF(C457=1,VLOOKUP(E457,Pivots!$AX$3:$BA$45,2))/2+IF(C457=2,VLOOKUP(E457,Pivots!$AX$3:$BA$45,3))/2+IF(C457=3,VLOOKUP(E457,Pivots!$AX$3:$BA$45,4))/2","v":0},"",{"$f":"VLOOKUP(A457,Players!$A$2:$B$92,2,FALSE)","v":{"$error":"#N/A"}},{"$f":"VLOOKUP(B457,Players!A$2:$B$92,2,FALSE)","v":{"$error":"#N/A"}}]
[null,null,1,null,{"$f":"E446+1","v":49},{"$f":"IF(C458=1,VLOOKUP(E458,Pivots!$AX$3:$BA$45,2))/2+IF(C458=2,VLOOKUP(E458,Pivots!$AX$3:$BA$45,3))/2+IF(C458=3,VLOOKUP(E458,Pivots!$AX$3:$BA$45,4))/2","v":0},"",{"$f":"VLOOKUP(A458,Players!$A$2:$B$92,2,FALSE)","v":{"$error":"#N/A"}},{"$f":"VLOOKUP(B458,Players!A$2:$B$92,2,FALSE)","v":{"$error":"#N/A"}}]
[null,null,1,null,{"$f":"E458","v":49},{"$f":"IF(C459=1,VLOOKUP(E459,Pivots!$AX$3:$BA$45,2))/2+IF(C459=2,VLOOKUP(E459,Pivots!$AX$3:$BA$45,3))/2+IF(C459=3,VLOOKUP(E459,Pivots!$AX$3:$BA$45,4))/2","v":0},"",{"$f":"VLOOKUP(A459,Players!$A$2:$B$92,2,FALSE)","v":{"$error":"#N/A"}},{"$f":"VLOOKUP(B459,Players!A$2:$B$92,2,FALSE)","v":{"$error":"#N/A"}}]
[null,null,1,null,{"$f":"E459","v":49},{"$f":"IF(C460=1,VLOOKUP(E460,Pivots!$AX$3:$BA$45,2))/2+IF(C460=2,VLOOKUP(E460,Pivots!$AX$3:$BA$45,3))/2+IF(C460=3,VLOOKUP(E460,Pivots!$AX$3:$BA$45,4))/2","v":0},"",{"$f":"VLOOKUP(A460,Players!$A$2:$B$92,2,FALSE)","v":{"$error":"#N/A"}},{"$f":"VLOOKUP(B460,Players!A$2:$B$92,2,FALSE)","v":{"$error":"#N/A"}}]
[null,null,1,null,49,{"$f":"IF(C461=1,VLOOKUP(E461,Pivots!$AX$3:$BA$45,2))/2+IF(C461=2,VLOOKUP(E461,Pivots!$AX$3:$BA$45,3))/2+IF(C461=3,VLOOKUP(E461,Pivots!$AX$3:$BA$45,4))/2","v":0},"",{"$f":"VLOOKUP(A461,Players!$A$2:$B$92,2,FALSE)","v":{"$error":"#N/A"}},{"$f":"VLOOKUP(B461,Players!A$2:$B$92,2,FALSE)","v":{"$error":"#N/A"}}]
[null,null,2,null,49,{"$f":"IF(C462=1,VLOOKUP(E462,Pivots!$AX$3:$BA$45,2))/2+IF(C462=2,VLOOKUP(E462,Pivots!$AX$3:$BA$45,3))/2+IF(C462=3,VLOOKUP(E462,Pivots!$AX$3:$BA$45,4))/2","v":0},"",{"$f":"VLOOKUP(A462,Players!$A$2:$B$92,2,FALSE)","v":{"$error":"#N/A"}},{"$f":"VLOOKUP(B462,Players!A$2:$B$92,2,FALSE)","v":{"$error":"#N/A"}}]
[null,null,2,null,49,{"$f":"IF(C463=1,VLOOKUP(E463,Pivots!$AX$3:$BA$45,2))/2+IF(C463=2,VLOOKUP(E463,Pivots!$AX$3:$BA$45,3))/2+IF(C463=3,VLOOKUP(E463,Pivots!$AX$3:$BA$45,4))/2","v":0},"",{"$f":"VLOOKUP(A463,Players!$A$2:$B$92,2,FALSE)","v":{"$error":"#N/A"}},{"$f":"VLOOKUP(B463,Players!A$2:$B$92,2,FALSE)","v":{"$error":"#N/A"}}]
[null,null,2,null,49,{"$f":"IF(C464=1,VLOOKUP(E464,Pivots!$AX$3:$BA$45,2))/2+IF(C464=2,VLOOKUP(E464,Pivots!$AX$3:$BA$45,3))/2+IF(C464=3,VLOOKUP(E464,Pivots!$AX$3:$BA$45,4))/2","v":0},"",{"$f":"VLOOKUP(A464,Players!$A$2:$B$92,2,FALSE)","v":{"$error":"#N/A"}},{"$f":"VLOOKUP(B464,Players!A$2:$B$92,2,FALSE)","v":{"$error":"#N/A"}}]
[null,null,2,null,49,{"$f":"IF(C465=1,VLOOKUP(E465,Pivots!$AX$3:$BA$45,2))/2+IF(C465=2,VLOOKUP(E465,Pivots!$AX$3:$BA$45,3))/2+IF(C465=3,VLOOKUP(E465,Pivots!$AX$3:$BA$45,4))/2","v":0},"",{"$f":"VLOOKUP(A465,Players!$A$2:$B$92,2,FALSE)","v":{"$error":"#N/A"}},{"$f":"VLOOKUP(B465,Players!A$2:$B$92,2,FALSE)","v":{"$error":"#N/A"}}]
[null,null,3,null,49,{"$f":"IF(C466=1,VLOOKUP(E466,Pivots!$AX$3:$BA$45,2))/2+IF(C466=2,VLOOKUP(E466,Pivots!$AX$3:$BA$45,3))/2+IF(C466=3,VLOOKUP(E466,Pivots!$AX$3:$BA$45,4))/2","v":0},"",{"$f":"VLOOKUP(A466,Players!$A$2:$B$92,2,FALSE)","v":{"$error":"#N/A"}},{"$f":"VLOOKUP(B466,Players!A$2:$B$92,2,FALSE)","v":{"$error":"#N/A"}}]
[null,null,3,null,49,{"$f":"IF(C467=1,VLOOKUP(E467,Pivots!$AX$3:$BA$45,2))/2+IF(C467=2,VLOOKUP(E467,Pivots!$AX$3:$BA$45,3))/2+IF(C467=3,VLOOKUP(E467,Pivots!$AX$3:$BA$45,4))/2","v":0},"",{"$f":"VLOOKUP(A467,Players!$A$2:$B$92,2,FALSE)","v":{"$error":"#N/A"}},{"$f":"VLOOKUP(B467,Players!A$2:$B$92,2,FALSE)","v":{"$error":"#N/A"}}]
[null,null,3,null,49,{"$f":"IF(C468=1,VLOOKUP(E468,Pivots!$AX$3:$BA$45,2))/2+IF(C468=2,VLOOKUP(E468,Pivots!$AX$3:$BA$45,3))/2+IF(C468=3,VLOOKUP(E468,Pivots!$AX$3:$BA$45,4))/2","v":0},"",{"$f":"VLOOKUP(A468,Players!$A$2:$B$92,2,FALSE)","v":{"$error":"#N/A"}},{"$f":"VLOOKUP(B468,Players!A$2:$B$92,2,FALSE)","v":{"$error":"#N/A"}}]
[null,null,3,null,49,{"$f":"IF(C469=1,VLOOKUP(E469,Pivots!$AX$3:$BA$45,2))/2+IF(C469=2,VLOOKUP(E469,Pivots!$AX$3:$BA$45,3))/2+IF(C469=3,VLOOKUP(E469,Pivots!$AX$3:$BA$45,4))/2","v":0},"",{"$f":"VLOOKUP(A469,Players!$A$2:$B$92,2,FALSE)","v":{"$error":"#N/A"}},{"$f":"VLOOKUP(B469,Players!A$2:$B$92,2,FALSE)","v":{"$error":"#N/A"}}]
[null,null,1,null,{"$f":"E458+1","v":50},{"$f":"IF(C470=1,VLOOKUP(E470,Pivots!$AX$3:$BA$45,2))/2+IF(C470=2,VLOOKUP(E470,Pivots!$AX$3:$BA$45,3))/2+IF(C470=3,VLOOKUP(E470,Pivots!$AX$3:$BA$45,4))/2","v":0},"",{"$f":"VLOOKUP(A470,Players!$A$2:$B$92,2,FALSE)","v":{"$error":"#N/A"}},{"$f":"VLOOKUP(B470,Players!A$2:$B$92,2,FALSE)","v":{"$error":"#N/A"}}]
[null,null,1,null,{"$f":"E470","v":50},{"$f":"IF(C471=1,VLOOKUP(E471,Pivots!$AX$3:$BA$45,2))/2+IF(C471=2,VLOOKUP(E471,Pivots!$AX$3:$BA$45,3))/2+IF(C471=3,VLOOKUP(E471,Pivots!$AX$3:$BA$45,4))/2","v":0},"",{"$f":"VLOOKUP(A471,Players!$A$2:$B$92,2,FALSE)","v":{"$error":"#N/A"}},{"$f":"VLOOKUP(B471,Players!A$2:$B$92,2,FALSE)","v":{"$error":"#N/A"}}]
[null,null,1,null,{"$f":"E471","v":50},{"$f":"IF(C472=1,VLOOKUP(E472,Pivots!$AX$3:$BA$45,2))/2+IF(C472=2,VLOOKUP(E472,Pivots!$AX$3:$BA$45,3))/2+IF(C472=3,VLOOKUP(E472,Pivots!$AX$3:$BA$45,4))/2","v":0},"",{"$f":"VLOOKUP(A472,Players!$A$2:$B$92,2,FALSE)","v":{"$error":"#N/A"}},{"$f":"VLOOKUP(B472,Players!A$2:$B$92,2,FALSE)","v":{"$error":"#N/A"}}]
[null,null,1,null,50,{"$f":"IF(C473=1,VLOOKUP(E473,Pivots!$AX$3:$BA$45,2))/2+IF(C473=2,VLOOKUP(E473,Pivots!$AX$3:$BA$45,3))/2+IF(C473=3,VLOOKUP(E473,Pivots!$AX$3:$BA$45,4))/2","v":0},"",{"$f":"VLOOKUP(A473,Players!$A$2:$B$92,2,FALSE)","v":{"$error":"#N/A"}},{"$f":"VLOOKUP(B473,Players!A$2:$B$92,2,FALSE)","v":{"$error":"#N/A"}}]
[null,null,2,null,50,{"$f":"IF(C474=1,VLOOKUP(E474,Pivots!$AX$3:$BA$45,2))/2+IF(C474=2,VLOOKUP(E474,Pivots!$AX$3:$BA$45,3))/2+IF(C474=3,VLOOKUP(E474,Pivots!$AX$3:$BA$45,4))/2","v":0},"",{"$f":"VLOOKUP(A474,Players!$A$2:$B$92,2,FALSE)","v":{"$error":"#N/A"}},{"$f":"VLOOKUP(B474,Players!A$2:$B$92,2,FALSE)","v":{"$error":"#N/A"}}]
[null,null,2,null,50,{"$f":"IF(C475=1,VLOOKUP(E475,Pivots!$AX$3:$BA$45,2))/2+IF(C475=2,VLOOKUP(E475,Pivots!$AX$3:$BA$45,3))/2+IF(C475=3,VLOOKUP(E475,Pivots!$AX$3:$BA$45,4))/2","v":0},"",{"$f":"VLOOKUP(A475,Players!$A$2:$B$92,2,FALSE)","v":{"$error":"#N/A"}},{"$f":"VLOOKUP(B475,Players!A$2:$B$92,2,FALSE)","v":{"$error":"#N/A"}}]
[null,null,2,null,50,{"$f":"IF(C476=1,VLOOKUP(E476,Pivots!$AX$3:$BA$45,2))/2+IF(C476=2,VLOOKUP(E476,Pivots!$AX$3:$BA$45,3))/2+IF(C476=3,VLOOKUP(E476,Pivots!$AX$3:$BA$45,4))/2","v":0},"",{"$f":"VLOOKUP(A476,Players!$A$2:$B$92,2,FALSE)","v":{"$error":"#N/A"}},{"$f":"VLOOKUP(B476,Players!A$2:$B$92,2,FALSE)","v":{"$error":"#N/A"}}]
[null,null,2,null,50,{"$f":"IF(C477=1,VLOOKUP(E477,Pivots!$AX$3:$BA$45,2))/2+IF(C477=2,VLOOKUP(E477,Pivots!$AX$3:$BA$45,3))/2+IF(C477=3,VLOOKUP(E477,Pivots!$AX$3:$BA$45,4))/2","v":0},"",{"$f":"VLOOKUP(A477,Players!$A$2:$B$92,2,FALSE)","v":{"$error":"#N/A"}},{"$f":"VLOOKUP(B477,Players!A$2:$B$92,2,FALSE)","v":{"$error":"#N/A"}}]
[null,null,3,null,50,{"$f":"IF(C478=1,VLOOKUP(E478,Pivots!$AX$3:$BA$45,2))/2+IF(C478=2,VLOOKUP(E478,Pivots!$AX$3:$BA$45,3))/2+IF(C478=3,VLOOKUP(E478,Pivots!$AX$3:$BA$45,4))/2","v":0},"",{"$f":"VLOOKUP(A478,Players!$A$2:$B$92,2,FALSE)","v":{"$error":"#N/A"}},{"$f":"VLOOKUP(B478,Players!A$2:$B$92,2,FALSE)","v":{"$error":"#N/A"}}]
[null,null,3,null,50,{"$f":"IF(C479=1,VLOOKUP(E479,Pivots!$AX$3:$BA$45,2))/2+IF(C479=2,VLOOKUP(E479,Pivots!$AX$3:$BA$45,3))/2+IF(C479=3,VLOOKUP(E479,Pivots!$AX$3:$BA$45,4))/2","v":0},"",{"$f":"VLOOKUP(A479,Players!$A$2:$B$92,2,FALSE)","v":{"$error":"#N/A"}},{"$f":"VLOOKUP(B479,Players!A$2:$B$92,2,FALSE)","v":{"$error":"#N/A"}}]
[null,null,3,null,50,{"$f":"IF(C480=1,VLOOKUP(E480,Pivots!$AX$3:$BA$45,2))/2+IF(C480=2,VLOOKUP(E480,Pivots!$AX$3:$BA$45,3))/2+IF(C480=3,VLOOKUP(E480,Pivots!$AX$3:$BA$45,4))/2","v":0},"",{"$f":"VLOOKUP(A480,Players!$A$2:$B$92,2,FALSE)","v":{"$error":"#N/A"}},{"$f":"VLOOKUP(B480,Players!A$2:$B$92,2,FALSE)","v":{"$error":"#N/A"}}]
[null,null,3,null,50,{"$f":"IF(C481=1,VLOOKUP(E481,Pivots!$AX$3:$BA$45,2))/2+IF(C481=2,VLOOKUP(E481,Pivots!$AX$3:$BA$45,3))/2+IF(C481=3,VLOOKUP(E481,Pivots!$AX$3:$BA$45,4))/2","v":0},"",{"$f":"VLOOKUP(A481,Players!$A$2:$B$92,2,FALSE)","v":{"$error":"#N/A"}},{"$f":"VLOOKUP(B481,Players!A$2:$B$92,2,FALSE)","v":{"$error":"#N/A"}}]
[null,null,1,null,{"$f":"E470+1","v":51},{"$f":"IF(C482=1,VLOOKUP(E482,Pivots!$AX$3:$BA$45,2))/2+IF(C482=2,VLOOKUP(E482,Pivots!$AX$3:$BA$45,3))/2+IF(C482=3,VLOOKUP(E482,Pivots!$AX$3:$BA$45,4))/2","v":0},"",{"$f":"VLOOKUP(A482,Players!$A$2:$B$92,2,FALSE)","v":{"$error":"#N/A"}},{"$f":"VLOOKUP(B482,Players!A$2:$B$92,2,FALSE)","v":{"$error":"#N/A"}}]
[null,null,1,null,{"$f":"E482","v":51},{"$f":"IF(C483=1,VLOOKUP(E483,Pivots!$AX$3:$BA$45,2))/2+IF(C483=2,VLOOKUP(E483,Pivots!$AX$3:$BA$45,3))/2+IF(C483=3,VLOOKUP(E483,Pivots!$AX$3:$BA$45,4))/2","v":0},"",{"$f":"VLOOKUP(A483,Players!$A$2:$B$92,2,FALSE)","v":{"$error":"#N/A"}},{"$f":"VLOOKUP(B483,Players!A$2:$B$92,2,FALSE)","v":{"$error":"#N/A"}}]
[null,null,1,null,{"$f":"E483","v":51},{"$f":"IF(C484=1,VLOOKUP(E484,Pivots!$AX$3:$BA$45,2))/2+IF(C484=2,VLOOKUP(E484,Pivots!$AX$3:$BA$45,3))/2+IF(C484=3,VLOOKUP(E484,Pivots!$AX$3:$BA$45,4))/2","v":0},"",{"$f":"VLOOKUP(A484,Players!$A$2:$B$92,2,FALSE)","v":{"$error":"#N/A"}},{"$f":"VLOOKUP(B484,Players!A$2:$B$92,2,FALSE)","v":{"$error":"#N/A"}}]
[null,null,1,null,51,{"$f":"IF(C485=1,VLOOKUP(E485,Pivots!$AX$3:$BA$45,2))/2+IF(C485=2,VLOOKUP(E485,Pivots!$AX$3:$BA$45,3))/2+IF(C485=3,VLOOKUP(E485,Pivots!$AX$3:$BA$45,4))/2","v":0},"",{"$f":"VLOOKUP(A485,Players!$A$2:$B$92,2,FALSE)","v":{"$error":"#N/A"}},{"$f":"VLOOKUP(B485,Players!A$2:$B$92,2,FALSE)","v":{"$error":"#N/A"}}]
[null,null,2,null,51,{"$f":"IF(C486=1,VLOOKUP(E486,Pivots!$AX$3:$BA$45,2))/2+IF(C486=2,VLOOKUP(E486,Pivots!$AX$3:$BA$45,3))/2+IF(C486=3,VLOOKUP(E486,Pivots!$AX$3:$BA$45,4))/2","v":0},"",{"$f":"VLOOKUP(A486,Players!$A$2:$B$92,2,FALSE)","v":{"$error":"#N/A"}},{"$f":"VLOOKUP(B486,Players!A$2:$B$92,2,FALSE)","v":{"$error":"#N/A"}}]
[null,null,2,null,51,{"$f":"IF(C487=1,VLOOKUP(E487,Pivots!$AX$3:$BA$45,2))/2+IF(C487=2,VLOOKUP(E487,Pivots!$AX$3:$BA$45,3))/2+IF(C487=3,VLOOKUP(E487,Pivots!$AX$3:$BA$45,4))/2","v":0},"",{"$f":"VLOOKUP(A487,Players!$A$2:$B$92,2,FALSE)","v":{"$error":"#N/A"}},{"$f":"VLOOKUP(B487,Players!A$2:$B$92,2,FALSE)","v":{"$error":"#N/A"}}]
[null,null,2,null,51,{"$f":"IF(C488=1,VLOOKUP(E488,Pivots!$AX$3:$BA$45,2))/2+IF(C488=2,VLOOKUP(E488,Pivots!$AX$3:$BA$45,3))/2+IF(C488=3,VLOOKUP(E488,Pivots!$AX$3:$BA$45,4))/2","v":0},"",{"$f":"VLOOKUP(A488,Players!$A$2:$B$92,2,FALSE)","v":{"$error":"#N/A"}},{"$f":"VLOOKUP(B488,Players!A$2:$B$92,2,FALSE)","v":{"$error":"#N/A"}}]
[null,null,2,null,51,{"$f":"IF(C489=1,VLOOKUP(E489,Pivots!$AX$3:$BA$45,2))/2+IF(C489=2,VLOOKUP(E489,Pivots!$AX$3:$BA$45,3))/2+IF(C489=3,VLOOKUP(E489,Pivots!$AX$3:$BA$45,4))/2","v":0},"",{"$f":"VLOOKUP(A489,Players!$A$2:$B$92,2,FALSE)","v":{"$error":"#N/A"}},{"$f":"VLOOKUP(B489,Players!A$2:$B$92,2,FALSE)","v":{"$error":"#N/A"}}]
[null,null,3,null,51,{"$f":"IF(C490=1,VLOOKUP(E490,Pivots!$AX$3:$BA$45,2))/2+IF(C490=2,VLOOKUP(E490,Pivots!$AX$3:$BA$45,3))/2+IF(C490=3,VLOOKUP(E490,Pivots!$AX$3:$BA$45,4))/2","v":0},"",{"$f":"VLOOKUP(A490,Players!$A$2:$B$92,2,FALSE)","v":{"$error":"#N/A"}},{"$f":"VLOOKUP(B490,Players!A$2:$B$92,2,FALSE)","v":{"$error":"#N/A"}}]
[null,null,3,null,51,{"$f":"IF(C491=1,VLOOKUP(E491,Pivots!$AX$3:$BA$45,2))/2+IF(C491=2,VLOOKUP(E491,Pivots!$AX$3:$BA$45,3))/2+IF(C491=3,VLOOKUP(E491,Pivots!$AX$3:$BA$45,4))/2","v":0},"",{"$f":"VLOOKUP(A491,Players!$A$2:$B$92,2,FALSE)","v":{"$error":"#N/A"}},{"$f":"VLOOKUP(B491,Players!A$2:$B$92,2,FALSE)","v":{"$error":"#N/A"}}]
[null,null,3,null,51,{"$f":"IF(C492=1,VLOOKUP(E492,Pivots!$AX$3:$BA$45,2))/2+IF(C492=2,VLOOKUP(E492,Pivots!$AX$3:$BA$45,3))/2+IF(C492=3,VLOOKUP(E492,Pivots!$AX$3:$BA$45,4))/2","v":0},"",{"$f":"VLOOKUP(A492,Players!$A$2:$B$92,2,FALSE)","v":{"$error":"#N/A"}},{"$f":"VLOOKUP(B492,Players!A$2:$B$92,2,FALSE)","v":{"$error":"#N/A"}}]
[null,null,3,null,51,{"$f":"IF(C493=1,VLOOKUP(E493,Pivots!$AX$3:$BA$45,2))/2+IF(C493=2,VLOOKUP(E493,Pivots!$AX$3:$BA$45,3))/2+IF(C493=3,VLOOKUP(E493,Pivots!$AX$3:$BA$45,4))/2","v":0},"",{"$f":"VLOOKUP(A493,Players!$A$2:$B$92,2,FALSE)","v":{"$error":"#N/A"}},{"$f":"VLOOKUP(B493,Players!A$2:$B$92,2,FALSE)","v":{"$error":"#N/A"}}]
[]
[]
[]
[]
[]
[]
[]
[{"$f":"B2","v":"RCO"},{"$f":"A2","v":"PPE"},{"$f":"C2","v":1},{"$f":"D2","v":-48},1,-96,-24]
[{"$f":"B3","v":"GW"},{"$f":"A3","v":"RB"},{"$f":"C3","v":1},-52,1,-96,-28]
["RPL","PD",{"$f":"C4","v":1},31,1,-96,55]
["TG","RHA",{"$f":"C5","v":1},-27,1,-96,-3]
["DA","APR",{"$f":"C6","v":2},-2,1,-37,7.25]
["DS","AKA",{"$f":"C7","v":2},37,1,-37,46.25]
["RS","TL",{"$f":"C8","v":2},-27,1,-37,-17.75]
["PPH","PW",{"$f":"C9","v":2},-45,1,-37,-35.75]
["VC","IC",{"$f":"C10","v":3},-14,1,2,-14.5]
["LH","PSW",{"$f":"C11","v":3},19,1,2,18.5]
["JUS","AS",{"$f":"C12","v":3},6,1,2,5.5]
["KAS","RW",{"$f":"C13","v":3},-9,1,2,-9.5]
["RCM","PSH",{"$f":"C14","v":1},59,2,123,28.25]
["KST","JAN",{"$f":"C15","v":1},37,2,123,6.25]
["RPL","PD",{"$f":"C16","v":1},30,2,123,-0.75]
["JAT","GW",{"$f":"C17","v":1},-3,2,123,-33.75]
["MR","PW",{"$f":"C18","v":2},71,2,129,38.75]
["PPE","RCO",{"$f":"C19","v":2},49,2,129,16.75]
["PPH","JSI",{"$f":"C20","v":2},5,2,129,-27.25]
["RHA","TG",{"$f":"C21","v":2},4,2,129,-28.25]
["MB","JAR",{"$f":"C22","v":3},62,2,61,46.75]
["VC","IC",{"$f":"C23","v":3},5,2,61,-10.25]
["DS","AKA",{"$f":"C24","v":3},-1,2,61,-16.25]
["MW","WA",{"$f":"C25","v":3},-5,2,61,-20.25]
["RCM","PSH",{"$f":"C26","v":1},26,3,42,15.5]
["RPL","PD",{"$f":"C27","v":1},20,3,42,9.5]
["WA","JAN",{"$f":"C28","v":1},9,3,42,-1.5]
["RB","GW",{"$f":"C29","v":1},-13,3,42,-23.5]
["MR","PW",{"$f":"C30","v":2},25,3,42,14.5]
["RCO","PPE",{"$f":"C31","v":2},12,3,42,1.5]
["RHA","TG",{"$f":"C32","v":2},10,3,42,-0.5]
["PPH","JSI",{"$f":"C33","v":2},-5,3,42,-15.5]
["PSW","KAS",{"$f":"C34","v":3},27,3,3,26.25]
["IC","VC",{"$f":"C35","v":3},12,3,3,11.25]
["JUS","AS",{"$f":"C36","v":3},-20,3,3,-20.75]
["DA","APR",{"$f":"C37","v":3},-16,3,3,-16.75]
["RPL","PD",{"$f":"C38","v":1},29,4,50,16.5]
["RCM","AKM",{"$f":"C39","v":1},24,4,50,11.5]
["GW","PSH",{"$f":"C40","v":1},20,4,50,7.5]
["BY","DN",{"$f":"C41","v":1},-23,4,50,-35.5]
["PPH","JSI",{"$f":"C42","v":2},30,4,28,23]
["RHA","TG",{"$f":"C43","v":2},-20,4,28,-27]
["VC","IC",{"$f":"C44","v":2},7,4,28,0]
["RCO","PPE",{"$f":"C45","v":2},11,4,28,4]
["APR","DA",{"$f":"C46","v":3},-18,4,-14,-14.5]
["RJ","PW",{"$f":"C47","v":3},-8,4,-14,-4.5]
["LH","AKA",{"$f":"C48","v":3},-5,4,-14,-1.5]
["JC","MR",{"$f":"C49","v":3},17,4,-14,20.5]
["GW","RB",{"$f":"C50","v":1},37,5,61,21.75]
["BY","PD",{"$f":"C51","v":1},46,5,61,30.75]
["RCM","PSH",{"$f":"C52","v":1},18,5,61,2.75]
["KST","JAN",{"$f":"C53","v":1},-40,5,61,-55.25]
["TG","RHA",{"$f":"C54","v":2},-21,5,10,-23.5]
["AS","IC",{"$f":"C55","v":2},13,5,10,10.5]
["MW","WA",{"$f":"C56","v":2},22,5,10,19.5]
["JSI","PPH",{"$f":"C57","v":2},-4,5,10,-6.5]
["PSW","LH",{"$f":"C58","v":3},6,5,-13,9.25]
["PW","RJ",{"$f":"C59","v":3},7,5,-13,10.25]
["APO","SP",{"$f":"C60","v":3},-33,5,-13,-29.75]
["RW","KAS",{"$f":"C61","v":3},7,5,-13,10.25]
["RPL","PD",{"$f":"C62","v":1},57,6,76,38]
["JAN","KST",{"$f":"C63","v":1},-29,6,76,-48]
["RB","GW",{"$f":"C64","v":1},16,6,76,-3]
["RCM","PSH",{"$f":"C65","v":1},32,6,76,13]
["WA","MW",{"$f":"C66","v":2},44,6,121,13.75]
[{"$f":"B67","v":"VC"},{"$f":"A67","v":"IC"},{"$f":"C67","v":2},38,6,121,7.75]
["JSI","PPH",{"$f":"C68","v":2},10,6,121,-20.25]
["RHA","TG",{"$f":"C69","v":2},29,6,121,-1.25]
["DA","APR",{"$f":"C70","v":3},14,6,131,-18.75]
["TL","RS",{"$f":"C71","v":3},41,6,131,8.25]
["RJ","PW",{"$f":"C72","v":3},32,6,131,-0.75]
["MR","JC",{"$f":"C73","v":3},44,6,131,11.25]
["RCM","PSH",{"$f":"C74","v":1},59,7,71,41.25]
["CRO","JAT",{"$f":"C75","v":1},20,7,71,2.25]
["RPL","PD",{"$f":"C76","v":1},11,7,71,-6.75]
["KST","RB",{"$f":"C77","v":1},-19,7,71,-36.75]
["MR","JC",{"$f":"C78","v":2},4,7,-32,12]
["JAR","MB",{"$f":"C79","v":2},0,7,-32,8]
["BY","DN",{"$f":"C80","v":2},-2,7,-32,6]
["JSI","PPH",{"$f":"C81","v":2},-34,7,-32,-26]
["DA","APR",{"$f":"C82","v":3},17,7,-35,25.75]
["VC","IC",{"$f":"C83","v":3},-6,7,-35,2.75]
["LH","AKA",{"$f":"C84","v":3},-38,7,-35,-29.25]
["RJ","PW",{"$f":"C85","v":3},-8,7,-35,0.75]
["GW","RB",{"$f":"C86","v":1},-11,11,-1,-10.75]
["RCM","PSH",{"$f":"C87","v":1},12,11,-1,12.25]
["RPL","PD",{"$f":"C88","v":1},5,11,-1,5.25]
["MR","JC",{"$f":"C89","v":1},-7,11,-1,-6.75]
["PPH","JSI",{"$f":"C90","v":2},3,11,6,1.5]
["PPE","RCO",{"$f":"C91","v":2},13,11,6,11.5]
["RHA","TG",{"$f":"C92","v":2},-4,11,6,-5.5]
["MW","PW",{"$f":"C93","v":2},-6,11,6,-7.5]
["TL","RS",{"$f":"C94","v":3},63,11,108,36]
["AS","JUS",{"$f":"C95","v":3},5,11,108,-22]
["AKA","LH",{"$f":"C96","v":3},5,11,108,-22]
["PSW","PL",{"$f":"C97","v":3},35,11,108,8]
["PD","RPL",{"$f":"C98","v":1},44.6,12,99.86999999999999,19.632500000000004]
["RB","GW",{"$f":"C99","v":1},9.5399999999999991,12,99.86999999999999,-15.427499999999998]
["PSH","RCM",{"$f":"C100","v":1},28.66,12,99.86999999999999,3.6925000000000026]
["CRO","JAT",{"$f":"C101","v":1},17.07,12,99.86999999999999,-7.8974999999999973]
["KST","JAN",{"$f":"C102","v":2},29.45,12,8.9100000000000019,27.2225]
["MR","JC",{"$f":"C103","v":2},6.53,12,8.9100000000000019,4.3025000000000002]
["JSI","PPH",{"$f":"C104","v":2},-9.26,12,8.9100000000000019,-11.487500000000001]
["MW","WA",{"$f":"C105","v":2},-17.809999999999999,12,8.9100000000000019,-20.037499999999998]
["TL","RS",{"$f":"C106","v":3},-29.16,12,-35.250000000000007,-20.347499999999997]
["RHA","TG",{"$f":"C107","v":3},-0.26,12,-35.250000000000007,8.552500000000002]
["RW","KAS",{"$f":"C108","v":3},-7.38,12,-35.250000000000007,1.4325000000000019]
["RJ","PW",{"$f":"C109","v":3},1.55,12,-35.250000000000007,10.362500000000002]
["RPL","PD",{"$f":"C110","v":1},43,13,69,25.75]
["RCM","PSH",{"$f":"C111","v":1},28,13,69,10.75]
["RB","GW",{"$f":"C112","v":1},26,13,69,8.75]
["KST","JAN",{"$f":"C113","v":1},-28,13,69,-45.25]
["RHA","TG",{"$f":"C114","v":2},42,13,99,17.25]
["JAR","MB",{"$f":"C115","v":2},30,13,99,5.25]
["JC","MR",{"$f":"C116","v":2},21,13,99,-3.75]
["MW","WA",{"$f":"C117","v":2},6,13,99,-18.75]
["PSW","Pl",{"$f":"C118","v":3},50,13,131,17.25]
["RJ","PW",{"$f":"C119","v":3},32,13,131,-0.75]
["RW","KAS",{"$f":"C120","v":3},22,13,131,-10.75]
["RS","TL",{"$f":"C121","v":3},27,13,131,-5.75]
["RPL","PD",{"$f":"C122","v":1},49,14,121,18.75]
["RCM","PSH",{"$f":"C123","v":1},29,14,121,-1.25]
["KST","JAN",{"$f":"C124","v":1},23,14,121,-7.25]
["GW","RB",{"$f":"C125","v":1},20,14,121,-10.25]
["JSI","PPH",{"$f":"C126","v":2},23,14,30,15.5]
["PPE","RCO",{"$f":"C127","v":2},9,14,30,1.5]
["JC","MR",{"$f":"C128","v":2},1,14,30,-6.5]
["MW","WA",{"$f":"C129","v":2},-3,14,30,-10.5]
["PSW","PL",{"$f":"C130","v":3},37,14,93,13.75]
[{"$f":"B131","v":"RJ"},{"$f":"A131","v":"PW"},{"$f":"C131","v":3},36,14,93,12.75]
["LH","AKA",{"$f":"C132","v":3},12,14,93,-11.25]
["DA","APR",{"$f":"C133","v":3},8,14,93,-15.25]
["PD","PSH",{"$f":"C134","v":1},49,15,57,34.75]
["KST","JAN",{"$f":"C135","v":1},16,15,57,1.75]
["RB","GW",{"$f":"C136","v":1},2,15,57,-12.25]
["CRO","JAT",{"$f":"C137","v":1},-10,15,57,-24.25]
["PL","PSW",{"$f":"C138","v":2},46,15,57,31.75]
["JC","MR",{"$f":"C139","v":2},4,15,57,-10.25]
["JSI","PPH",{"$f":"C140","v":2},5,15,57,-9.25]
["PPe","RCO",{"$f":"C141","v":2},2,15,57,-12.25]
["As","JUS",{"$f":"C142","v":3},11,15,11,8.25]
["RJ","PW",{"$f":"C143","v":3},11,15,11,8.25]
["TL","RS",{"$f":"C144","v":3},4,15,11,1.25]
["APR","DA",{"$f":"C145","v":3},-15,15,11,-17.75]
["RCM","PSH",{"$f":"C146","v":1},21,16,12,18]
["CRO","JAT",{"$f":"C147","v":1},16,16,12,13]
["RPL","PD",{"$f":"C148","v":1},-8,16,12,-11]
["RB","GW",{"$f":"C149","v":1},-17,16,12,-20]
["JSI","PPH",{"$f":"C150","v":2},41,16,3,40.25]
["PPE","RCO",{"$f":"C151","v":2},15,16,3,14.25]
["AW","TH",{"$f":"C152","v":2},-27,16,3,-27.75]
["MB","JAR",{"$f":"C153","v":2},-26,16,3,-26.75]
["TL","RS",{"$f":"C154","v":3},42,16,-33,50.25]
["AKA","LH",{"$f":"C155","v":3},-48,16,-33,-39.75]
["RJ","PW",{"$f":"C156","v":3},-26,16,-33,-17.75]
["RHA","TG",{"$f":"C157","v":3},-1,16,-33,7.25]
["GW","RB",{"$f":"C158","v":1},31,21,191,-16.75]
["CRO","JAT",{"$f":"C159","v":1},104,21,191,56.25]
["RCM","JAN",{"$f":"C160","v":1},32,21,191,-15.75]
["RPL","PD",{"$f":"C161","v":1},24,21,191,-23.75]
["TL","RS",{"$f":"C162","v":2},14,21,67,-2.75]
["MR","JC",{"$f":"C163","v":2},21,21,67,4.25]
["PPE","RCO",{"$f":"C164","v":2},27,21,67,10.25]
["PL","PSW",{"$f":"C165","v":2},5,21,67,-11.75]
["PW","RJ",{"$f":"C166","v":3},50,21,64,34]
["JAR","MB",{"$f":"C167","v":3},23,21,64,7]
["MW","WA",{"$f":"C168","v":3},16,21,64,0]
["VC","JSI",{"$f":"C169","v":3},-25,21,64,-41]
["RCM","PSH",{"$f":"C170","v":1},25,22,1,24.75]
["KST","RB",{"$f":"C171","v":1},22,22,1,21.75]
["WA","JAN",{"$f":"C172","v":1},-39,22,1,-39.25]
["RPL","PD",{"$f":"C173","v":1},-7,22,1,-7.25]
["TL","RS",{"$f":"C174","v":2},28,22,88,6]
["PPE","RCO",{"$f":"C175","v":2},14,22,88,-8]
["JAR","MB",{"$f":"C176","v":2},-10,22,88,-32]
["MW","PPH",{"$f":"C177","v":2},56,22,88,34]
["VC","JSI",{"$f":"C178","v":3},41,22,98,16.5]
["JSI","AS",{"$f":"C179","v":3},-12,22,98,-36.5]
["BR","RHA",{"$f":"C180","v":3},51,22,98,26.5]
["RJ","PW",{"$f":"C181","v":3},18,22,98,-6.5]
["JAN","KST",{"$f":"C182","v":1},37,23,46,25.5]
["AKM","RB",{"$f":"C183","v":1},-10,23,46,-21.5]
["TH","AW",{"$f":"C184","v":1},2,23,46,-9.5]
["RPL","PD",{"$f":"C185","v":1},17,23,46,5.5]
["JC","MR",{"$f":"C186","v":2},10,23,-65,26.25]
["JSI","VC",{"$f":"C187","v":2},-13,23,-65,3.25]
["TL","RS",{"$f":"C188","v":2},-26,23,-65,-9.75]
["PL","PSW",{"$f":"C189","v":2},-36,23,-65,-19.75]
["APR","DA",{"$f":"C190","v":3},31,23,88,9]
["RHA","BR",{"$f":"C191","v":3},27,23,88,5]
["pph","MW",{"$f":"C192","v":3},25,23,88,3]
["RJ","PW",{"$f":"C193","v":3},5,23,88,-17]
["RCM","PSH",{"$f":"C194","v":1},11,24,-3,11.75]
[{"$f":"B195","v":"RPL"},{"$f":"A195","v":"PD"},{"$f":"C195","v":1},-1,24,-3,-0.25]
["GW","RB",{"$f":"C196","v":1},26,24,-3,26.75]
["TH","AW",{"$f":"C197","v":1},-39,24,-3,-38.25]
["JSi","VC",{"$f":"C198","v":2},-16,24,-32,-8]
["Pl","PSW",{"$f":"C199","v":2},46,24,-32,54]
["MR","RCO",{"$f":"C200","v":2},-67,24,-32,-59]
["MW","PPH",{"$f":"C201","v":2},5,24,-32,13]
["RJ","PW",{"$f":"C202","v":3},33,24,-18,37.5]
["BR","RHA",{"$f":"C203","v":3},68,24,-18,72.5]
["Rw","ML",{"$f":"C204","v":3},-31,24,-18,-26.5]
["AS","JUS",{"$f":"C205","v":3},-88,24,-18,-83.5]
["RCM","psh",{"$f":"C206","v":1},48,25,90,25.5]
["KST","JAN",{"$f":"C207","v":1},33,25,90,10.5]
["RPL","PD",{"$f":"C208","v":1},25,25,90,2.5]
["AS","GW",{"$f":"C209","v":1},-16,25,90,-38.5]
["RHA","BR",{"$f":"C210","v":2},8,25,-2,8.5]
["PL","PSW",{"$f":"C211","v":2},8,25,-2,8.5]
["TL","RS",{"$f":"C212","v":2},24,25,-2,24.5]
["JC","MR",{"$f":"C213","v":2},-42,25,-2,-41.5]
["DA","APR",{"$f":"C214","v":3},32,25,84,11]
["JSI","VC",{"$f":"C215","v":3},19,25,84,-2]
["JAR","MB",{"$f":"C216","v":3},17,25,84,-4]
["RJ","PW",{"$f":"C217","v":3},16,25,84,-5]
["RPL","PD",{"$f":"C218","v":1},50.91,26,89.6,28.509999999999998]
["GW","RB",{"$f":"C219","v":1},4.18,26,89.6,-18.22]
["KST","JAN",{"$f":"C220","v":1},-6.37,26,89.6,-28.77]
["RCM","PSH",{"$f":"C221","v":1},40.880000000000003,26,89.6,18.480000000000004]
["MR","JC",{"$f":"C222","v":2},19.899999999999999,26,51.14,7.1149999999999984]
["RHA","BR",{"$f":"C223","v":2},11.36,26,51.14,-1.4250000000000007]
["PPH","MW",{"$f":"C224","v":2},10.15,26,51.14,-2.6349999999999998]
["PL","PSW",{"$f":"C225","v":2},9.73,26,51.14,-3.0549999999999997]
["Jus","AS",{"$f":"C226","v":3},30.26,26,-66.430000000000007,46.867500000000007]
["JSI","VC",{"$f":"C227","v":3},19.12,26,-66.430000000000007,35.727500000000006]
["JA","MB",{"$f":"C228","v":3},-47.55,26,-66.430000000000007,-30.942499999999995]
["RJ","PW",{"$f":"C229","v":3},-68.260000000000005,26,-66.430000000000007,-51.652500000000003]
[0,0,{"$f":"C230","v":1},0,27,0,""]
[0,0,{"$f":"C231","v":1},0,27,0,""]
[0,0,{"$f":"C232","v":1},0,27,0,""]
[0,0,{"$f":"C233","v":1},0,27,0,""]
[0,0,{"$f":"C234","v":2},0,27,0,""]
[0,0,{"$f":"C235","v":2},0,27,0,""]
[0,0,{"$f":"C236","v":2},0,27,0,""]
[0,0,{"$f":"C237","v":2},0,27,0,""]
[0,0,{"$f":"C238","v":3},0,27,0,""]
[0,0,{"$f":"C239","v":3},0,27,0,""]
[0,0,{"$f":"C240","v":3},0,27,0,""]
[0,0,{"$f":"C241","v":3},0,27,0,""]
[0,0,{"$f":"C242","v":1},0,31,0,""]
[0,0,{"$f":"C243","v":1},0,31,0,""]
[0,0,{"$f":"C244","v":1},0,31,0,""]
[0,0,{"$f":"C245","v":1},0,31,0,""]
[0,0,{"$f":"C246","v":2},0,31,0,""]
[0,0,{"$f":"C247","v":2},0,31,0,""]
[0,0,{"$f":"C248","v":2},0,31,0,""]
[0,0,{"$f":"C249","v":2},0,31,0,""]
[0,0,{"$f":"C250","v":3},0,31,0,""]
[0,0,{"$f":"C251","v":3},0,31,0,""]
[0,0,{"$f":"C252","v":3},0,31,0,""]
[0,0,{"$f":"C253","v":3},0,31,0,""]
[0,0,{"$f":"C254","v":1},0,32,0,""]
[0,0,{"$f":"C255","v":1},0,32,0,""]
[0,0,{"$f":"C256","v":1},0,32,0,""]
[0,0,{"$f":"C257","v":1},0,32,0,""]
[0,0,{"$f":"C258","v":2},0,32,0,""]
[{"$f":"B259","v":0},{"$f":"A259","v":0},{"$f":"C259","v":2},0,32,0,""]
[0,0,{"$f":"C260","v":2},0,32,0,""]
[0,0,{"$f":"C261","v":2},0,32,0,""]
[0,0,{"$f":"C262","v":3},0,32,0,""]
[0,0,{"$f":"C263","v":3},0,32,0,""]
[0,0,{"$f":"C264","v":3},0,32,0,""]
[0,0,{"$f":"C265","v":3},0,32,0,""]
[0,0,{"$f":"C266","v":1},0,33,0,""]
[0,0,{"$f":"C267","v":1},0,33,0,""]
[0,0,{"$f":"C268","v":1},0,33,0,""]
[0,0,{"$f":"C269","v":1},0,33,0,""]
[0,0,{"$f":"C270","v":2},0,33,0,""]
[0,0,{"$f":"C271","v":2},0,33,0,""]
[0,0,{"$f":"C272","v":2},0,33,0,""]
[0,0,{"$f":"C273","v":2},0,33,0,""]
[0,0,{"$f":"C274","v":3},0,33,0,""]
[0,0,{"$f":"C275","v":3},0,33,0,""]
[0,0,{"$f":"C276","v":3},0,33,0,""]
[0,0,{"$f":"C277","v":3},0,33,0,""]
[0,0,{"$f":"C278","v":1},0,34,0,""]
[0,0,{"$f":"C279","v":1},0,34,0,""]
[0,0,{"$f":"C280","v":1},0,34,0,""]
[0,0,{"$f":"C281","v":1},0,34,0,""]
[0,0,{"$f":"C282","v":2},0,34,0,""]
[0,0,{"$f":"C283","v":2},0,34,0,""]
[0,0,{"$f":"C284","v":2},0,34,0,""]
[0,0,{"$f":"C285","v":2},0,34,0,""]
[0,0,{"$f":"C286","v":3},0,34,0,""]
[0,0,{"$f":"C287","v":3},0,34,0,""]
[0,0,{"$f":"C288","v":3},0,34,0,""]
[0,0,{"$f":"C289","v":3},0,34,0,""]
[0,0,{"$f":"C290","v":1},0,35,0,""]
[0,0,{"$f":"C291","v":1},0,35,0,""]
[0,0,{"$f":"C292","v":1},0,35,0,""]
[0,0,{"$f":"C293","v":1},0,35,0,""]
[0,0,{"$f":"C294","v":2},0,35,0,""]
[0,0,{"$f":"C295","v":2},0,35,0,""]
[0,0,{"$f":"C296","v":2},0,35,0,""]
[0,0,{"$f":"C297","v":2},0,35,0,""]
[0,0,{"$f":"C298","v":3},0,35,0,""]
[0,0,{"$f":"C299","v":3},0,35,0,""]
[0,0,{"$f":"C300","v":3},0,35,0,""]
[0,0,{"$f":"C301","v":3},0,35,0,""]
[0,0,{"$f":"C302","v":1},0,36,0,""]
[0,0,{"$f":"C303","v":1},0,36,0,""]
[0,0,{"$f":"C304","v":1},0,36,0,""]
[0,0,{"$f":"C305","v":1},0,36,0,""]
[0,0,{"$f":"C306","v":2},0,36,0,""]
[0,0,{"$f":"C307","v":2},0,36,0,""]
[0,0,{"$f":"C308","v":2},0,36,0,""]
[0,0,{"$f":"C309","v":2},0,36,0,""]
[0,0,{"$f":"C310","v":3},0,36,0,""]
[0,0,{"$f":"C311","v":3},0,36,0,""]
[0,0,{"$f":"C312","v":3},0,36,0,""]
[0,0,{"$f":"C313","v":3},0,36,0,""]
[0,0,{"$f":"C314","v":1},0,37,0,""]
[0,0,{"$f":"C315","v":1},0,37,0,""]
[0,0,{"$f":"C316","v":1},0,37,0,""]
[0,0,{"$f":"C317","v":1},0,37,0,""]
[0,0,{"$f":"C318","v":2},0,37,0,""]
[0,0,{"$f":"C319","v":2},0,37,0,""]
[0,0,{"$f":"C320","v":2},0,37,0,""]
[0,0,{"$f":"C321","v":2},0,37,0,""]
[0,0,{"$f":"C322","v":3},0,37,0,""]
[{"$f":"B323","v":0},{"$f":"A323","v":0},{"$f":"C323","v":3},0,37,0,""]
[0,0,{"$f":"C324","v":3},0,37,0,""]
[0,0,{"$f":"C325","v":3},0,37,0,""]
[0,0,{"$f":"C326","v":1},0,38,0,""]
[0,0,{"$f":"C327","v":1},0,38,0,""]
[0,0,{"$f":"C328","v":1},0,38,0,""]
[0,0,{"$f":"C329","v":1},0,38,0,""]
[0,0,{"$f":"C330","v":2},0,38,0,""]
[0,0,{"$f":"C331","v":2},0,38,0,""]
[0,0,{"$f":"C332","v":2},0,38,0,""]
[0,0,{"$f":"C333","v":2},0,38,0,""]
[0,0,{"$f":"C334","v":3},0,38,0,""]
[0,0,{"$f":"C335","v":3},0,38,0,""]
[0,0,{"$f":"C336","v":3},0,38,0,""]
[0,0,{"$f":"C337","v":3},0,38,0,""]
[0,0,{"$f":"C338","v":1},0,39,0,""]
[0,0,{"$f":"C339","v":1},0,39,0,""]
[0,0,{"$f":"C340","v":1},0,39,0,""]
[0,0,{"$f":"C341","v":1},0,39,0,""]
[0,0,{"$f":"C342","v":2},0,39,0,""]
[0,0,{"$f":"C343","v":2},0,39,0,""]
[0,0,{"$f":"C344","v":2},0,39,0,""]
[0,0,{"$f":"C345","v":2},0,39,0,""]
[0,0,{"$f":"C346","v":3},0,39,0,""]
[0,0,{"$f":"C347","v":3},0,39,0,""]
[0,0,{"$f":"C348","v":3},0,39,0,""]
[0,0,{"$f":"C349","v":3},0,39,0,""]
[0,0,{"$f":"C350","v":1},0,40,0,""]
[0,0,{"$f":"C351","v":1},0,40,0,""]
[0,0,{"$f":"C352","v":1},0,40,0,""]
[0,0,{"$f":"C353","v":1},0,40,0,""]
[0,0,{"$f":"C354","v":2},0,40,0,""]
[0,0,{"$f":"C355","v":2},0,40,0,""]
[0,0,{"$f":"C356","v":2},0,40,0,""]
[0,0,{"$f":"C357","v":2},0,40,0,""]
[0,0,{"$f":"C358","v":3},0,40,0,""]
[0,0,{"$f":"C359","v":3},0,40,0,""]
[0,0,{"$f":"C360","v":3},0,40,0,""]
[0,0,{"$f":"C361","v":3},0,40,0,""]
[0,0,{"$f":"C362","v":1},0,41,0,""]
[0,0,{"$f":"C363","v":1},0,41,0,""]
[0,0,{"$f":"C364","v":1},0,41,0,""]
[0,0,{"$f":"C365","v":1},0,41,0,""]
[0,0,{"$f":"C366","v":2},0,41,0,""]
[0,0,{"$f":"C367","v":2},0,41,0,""]
[0,0,{"$f":"C368","v":2},0,41,0,""]
[0,0,{"$f":"C369","v":2},0,41,0,""]
[0,0,{"$f":"C370","v":3},0,41,0,""]
[0,0,{"$f":"C371","v":3},0,41,0,""]
[0,0,{"$f":"C372","v":3},0,41,0,""]
[0,0,{"$f":"C373","v":3},0,41,0,""]
[0,0,{"$f":"C374","v":1},0,42,0,""]
[0,0,{"$f":"C375","v":1},0,42,0,""]
[0,0,{"$f":"C376","v":1},0,42,0,""]
[0,0,{"$f":"C377","v":1},0,42,0,""]
[0,0,{"$f":"C378","v":2},0,42,0,""]
[0,0,{"$f":"C379","v":2},0,42,0,""]
[0,0,{"$f":"C380","v":2},0,42,0,""]
[0,0,{"$f":"C381","v":2},0,42,0,""]
[0,0,{"$f":"C382","v":3},0,42,0,""]
[0,0,{"$f":"C383","v":3},0,42,0,""]
[0,0,{"$f":"C384","v":3},0,42,0,""]
[0,0,{"$f":"C385","v":3},0,42,0,""]
[0,0,{"$f":"C386","v":1},0,43,0,""]
[{"$f":"B387","v":0},{"$f":"A387","v":0},{"$f":"C387","v":1},0,43,0,""]
[0,0,{"$f":"C388","v":1},0,43,0,""]
[0,0,{"$f":"C389","v":1},0,43,0,""]
[0,0,{"$f":"C390","v":2},0,43,0,""]
[0,0,{"$f":"C391","v":2},0,43,0,""]
[0,0,{"$f":"C392","v":2},0,43,0,""]
[0,0,{"$f":"C393","v":2},0,43,0,""]
[0,0,{"$f":"C394","v":3},0,43,0,""]
[0,0,{"$f":"C395","v":3},0,43,0,""]
[0,0,{"$f":"C396","v":3},0,43,0,""]
[0,0,{"$f":"C397","v":3},0,43,0,""]
[0,0,{"$f":"C398","v":1},0,44,0,""]
[0,0,{"$f":"C399","v":1},0,44,0,""]
[0,0,{"$f":"C400","v":1},0,44,0,""]
[0,0,{"$f":"C401","v":1},0,44,0,""]
[0,0,{"$f":"C402","v":2},0,44,0,""]
[0,0,{"$f":"C403","v":2},0,44,0,""]
[0,0,{"$f":"C404","v":2},0,44,0,""]
[0,0,{"$f":"C405","v":2},0,44,0,""]
[0,0,{"$f":"C406","v":3},0,44,0,""]
[0,0,{"$f":"C407","v":3},0,44,0,""]
[0,0,{"$f":"C408","v":3},0,44,0,""]
[0,0,{"$f":"C409","v":3},0,44,0,""]
[0,0,{"$f":"C410","v":1},0,45,0,""]
[0,0,{"$f":"C411","v":1},0,45,0,""]
[0,0,{"$f":"C412","v":1},0,45,0,""]
[0,0,{"$f":"C413","v":1},0,45,0,""]
[0,0,{"$f":"C414","v":2},0,45,0,""]
[0,0,{"$f":"C415","v":2},0,45,0,""]
[0,0,{"$f":"C416","v":2},0,45,0,""]
[0,0,{"$f":"C417","v":2},0,45,0,""]
[0,0,{"$f":"C418","v":3},0,45,0,""]
[0,0,{"$f":"C419","v":3},0,45,0,""]
[0,0,{"$f":"C420","v":3},0,45,0,""]
[0,0,{"$f":"C421","v":3},0,45,0,""]
[0,0,{"$f":"C422","v":1},0,46,0,""]
[0,0,{"$f":"C423","v":1},0,46,0,""]
[0,0,{"$f":"C424","v":1},0,46,0,""]
[0,0,{"$f":"C425","v":1},0,46,0,""]
[0,0,{"$f":"C426","v":2},0,46,0,""]
[0,0,{"$f":"C427","v":2},0,46,0,""]
[0,0,{"$f":"C428","v":2},0,46,0,""]
[0,0,{"$f":"C429","v":2},0,46,0,""]
[0,0,{"$f":"C430","v":3},0,46,0,""]
[0,0,{"$f":"C431","v":3},0,46,0,""]
[0,0,{"$f":"C432","v":3},0,46,0,""]
[0,0,{"$f":"C433","v":3},0,46,0,""]
[0,0,{"$f":"C434","v":1},0,47,0,""]
[0,0,{"$f":"C435","v":1},0,47,0,""]
[0,0,{"$f":"C436","v":1},0,47,0,""]
[0,0,{"$f":"C437","v":1},0,47,0,""]
[0,0,{"$f":"C438","v":2},0,47,0,""]
[0,0,{"$f":"C439","v":2},0,47,0,""]
[0,0,{"$f":"C440","v":2},0,47,0,""]
[0,0,{"$f":"C441","v":2},0,47,0,""]
[0,0,{"$f":"C442","v":3},0,47,0,""]
[0,0,{"$f":"C443","v":3},0,47,0,""]
[0,0,{"$f":"C444","v":3},0,47,0,""]
[0,0,{"$f":"C445","v":3},0,47,0,""]
[0,0,{"$f":"C446","v":1},0,48,0,""]
[0,0,{"$f":"C447","v":1},0,48,0,""]
[0,0,{"$f":"C448","v":1},0,48,0,""]
[0,0,{"$f":"C449","v":1},0,48,0,""]
[0,0,{"$f":"C450","v":2},0,48,0,""]
[{"$f":"B451","v":0},{"$f":"A451","v":0},{"$f":"C451","v":2},0,48,0,""]
[0,0,{"$f":"C452","v":2},0,48,0,""]
[0,0,{"$f":"C453","v":2},0,48,0,""]
[0,0,{"$f":"C454","v":3},0,48,0,""]
[0,0,{"$f":"C455","v":3},0,48,0,""]
[0,0,{"$f":"C456","v":3},0,48,0,""]
[0,0,{"$f":"C457","v":3},0,48,0,""]
[0,0,{"$f":"C458","v":1},0,49,0,""]
[0,0,{"$f":"C459","v":1},0,49,0,""]
[0,0,{"$f":"C460","v":1},0,49,0,""]
[0,0,{"$f":"C461","v":1},0,49,0,""]
[0,0,{"$f":"C462","v":2},0,49,0,""]
[0,0,{"$f":"C463","v":2},0,49,0,""]
[0,0,{"$f":"C464","v":2},0,49,0,""]
[0,0,{"$f":"C465","v":2},0,49,0,""]
[0,0,{"$f":"C466","v":3},0,49,0,""]
[0,0,{"$f":"C467","v":3},0,49,0,""]
[0,0,{"$f":"C468","v":3},0,49,0,""]
[0,0,{"$f":"C469","v":3},0,49,0,""]
[0,0,{"$f":"C470","v":1},0,50,0,""]
[0,0,{"$f":"C471","v":1},0,50,0,""]
[0,0,{"$f":"C472","v":1},0,50,0,""]
[0,0,{"$f":"C473","v":1},0,50,0,""]
[0,0,{"$f":"C474","v":2},0,50,0,""]
[0,0,{"$f":"C475","v":2},0,50,0,""]
[0,0,{"$f":"C476","v":2},0,50,0,""]
[0,0,{"$f":"C477","v":2},0,50,0,""]
[0,0,{"$f":"C478","v":3},0,50,0,""]
[0,0,{"$f":"C479","v":3},0,50,0,""]
[0,0,{"$f":"C480","v":3},0,50,0,""]
[0,0,{"$f":"C481","v":3},0,50,0,""]
[0,0,{"$f":"C482","v":1},0,51,0,""]
[0,0,{"$f":"C483","v":1},0,51,0,""]
[0,0,{"$f":"C484","v":1},0,51,0,""]
[0,0,{"$f":"C485","v":1},0,51,0,""]
[0,0,{"$f":"C486","v":2},0,51,0,""]
[0,0,{"$f":"C487","v":2},0,51,0,""]
[0,0,{"$f":"C488","v":2},0,51,0,""]
[0,0,{"$f":"C489","v":2},0,51,0,""]
[0,0,{"$f":"C490","v":3},0,51,0,""]
[0,0,{"$f":"C491","v":3},0,51,0,""]
[0,0,{"$f":"C492","v":3},0,51,0,""]
[0,0,{"$f":"C493","v":3},0,51,0,""]